program: Orca
programVersion: 5.0.2
elementType: N H C C H H O C C O N H H H C C O H O H N H H H C H H C C C C H C H C H H O H
charge: 1
multiplicity: 1
keywords: wB97X-D3BJ Opt Freq def2-TZVPP def2/J RIJCOSX VeryTightSCF
keywords: PAL8 defgrid3 VeryTightOpt
frequency: 0.00 0.00 0.00 0.00 0.00 0.00 18.22 28.83 48.75 56.24 76.18 90.86 114.62 131.90 151.31 170.40 193.33 197.88 223.98 241.25 266.25 292.36 325.81 343.37 360.10 381.23 384.54 414.19 423.92 429.22 435.11 463.03 473.29 526.51 571.27 592.90 607.20 622.98 655.52 664.17 681.37 740.31 754.48 779.13 803.91 811.93 823.24 849.73 857.97 871.22 885.66 896.65 922.59 932.14 962.79 975.91 1012.45 1016.08 1035.66 1042.83 1050.67 1074.04 1109.71 1138.30 1148.33 1156.00 1193.51 1207.74 1226.68 1239.20 1250.95 1250.98 1280.38 1321.05 1328.40 1333.30 1337.42 1344.00 1371.48 1372.80 1389.43 1399.62 1430.01 1440.53 1488.19 1491.24 1493.21 1499.79 1549.81 1569.24 1581.99 1583.72 1630.97 1666.64 1673.38 1703.12 1755.98 1779.07 1818.34 3055.71 3082.11 3129.54 3131.49 3132.58 3139.28 3171.86 3195.35 3203.54 3205.54 3206.66 3232.66 3443.76 3522.00 3553.55 3639.13 3648.20 3877.88
frequency: 18.22 28.83 48.75 56.24 76.18 90.86 114.62 131.90 151.31 170.40 193.33 197.88 223.98 241.25 266.25 292.36 325.81 343.37 360.10 381.23 384.54 414.19 423.92 429.22 435.11 463.03 473.29 526.51 571.27 592.90 607.20 622.98 655.52 664.17 681.37 740.31 754.48 779.13 803.91 811.93 823.24 849.73 857.97 871.22 885.66 896.65 922.59 932.14 962.79 975.91 1012.45 1016.08 1035.66 1042.83 1050.67 1074.04 1109.71 1138.30 1148.33 1156.00 1193.51 1207.74 1226.68 1239.20 1250.95 1250.98 1280.38 1321.05 1328.40 1333.30 1337.42 1344.00 1371.48 1372.80 1389.43 1399.62 1430.01 1440.53 1488.19 1491.24 1493.21 1499.79 1549.81 1569.24 1581.99 1583.72 1630.97 1666.64 1673.38 1703.12 1755.98 1779.07 1818.34 3055.71 3082.11 3129.54 3131.49 3132.58 3139.28 3171.86 3195.35 3203.54 3205.54 3206.66 3232.66 3443.76 3522.00 3553.55 3639.13 3648.20 3877.88
formula: C13H18N3O5
InChI: InChI=1S/C13H18N3O5/c14-10(5-8-1-3-9(17)4-2-8)13(21)16-6-11(18)15-7-12(19)20/h1-4,10,15-17,19H,5-7H2,14H3
39 atoms
N  0.564317 1.992044 -2.338891
H  1.126158 2.414885 -1.615795
C  1.258302 1.63548 -3.57399
C  1.940782 0.297693 -3.295075
H  0.544784 1.566041 -4.393685
H  2.010746 2.385899 -3.798138
O  3.098966 0.203281 -2.947536
C  -0.498742 1.256573 -1.93646
C  -0.735514 1.205842 -0.429358
O  -1.114641 0.511199 -2.688142
N  0.013657 0.019133 0.003569
H  -1.79142 1.057251 -0.220783
H  -0.367045 2.080729 0.101719
H  -0.435215 -0.867599 -0.164673
C  1.364992 0.051513 0.025201
C  2.079904 -1.303563 0.012056
O  2.020395 1.079619 0.030164
H  1.611591 -1.957482 -0.724848
O  1.157078 -0.776184 -3.305778
H  0.222953 -0.512126 -3.439969
N  3.456628 -0.997101 -0.486944
H  4.079593 -1.7942 -0.376975
H  3.430686 -0.689616 -1.485886
H  3.818409 -0.212089 0.063462
C  2.144625 -1.982845 1.391162
H  2.510428 -3.003212 1.251512
H  1.12224 -2.066605 1.765711
C  3.024953 -1.241199 2.366529
C  2.560581 -0.113273 3.047023
C  4.338504 -1.647442 2.583074
C  3.38119 0.592604 3.905055
H  1.534801 0.214378 2.914492
C  5.177923 -0.947405 3.440037
H  4.715359 -2.546741 2.103074
C  4.699763 0.179827 4.102259
H  3.02005 1.461524 4.440254
H  6.194487 -1.287847 3.605271
O  5.454649 0.911765 4.953041
H  6.329466 0.526559 5.04838
totalener: -1047.13600609 hartree
nucrepener: 1793.30750549 hartree
electener: -2840.44351158 hartree
oneelecener: -4969.68449244 hartree
twoeener: 2129.24098086 hartree
kineticenergy: 1041.99275811 hartree
exchangeener: -91.591021987422 hartree
correlationener: -6.620433258803 hartree
xcener: -98.211455246226 hartree
temp: 298.15 k
press: 1.00 atm
thermalcorrenthalpy: 0.00094421 hartree
totalenthalpy: -1046.88196968 hartree
totalentropycorr: -0.06221775 hartree
gibbsenthalpy: -1046.94418743 hartree
gibbsminuselec: 0.27951078 hartree
totalenthalpy: -1046.88369275 hartree
chargesum: 1.0000000
charge: -0.158920 0.205506 -0.128777 0.336746 0.158723 0.144252 -0.347535 0.225202 -0.094055 -0.386347 -0.154059 0.150819 0.145778 0.191925 0.108262 0.052431 -0.363933 0.166301 -0.245857 0.251602 -0.085988 0.221363 0.241669 0.245466 -0.205527 0.140991 0.132449 0.036271 -0.124676 -0.243849 -0.125525 0.117408 -0.125915 0.134774 0.181837 0.139215 0.115063 -0.269873 0.216781
charge: 0.338734 -0.015651 -0.021762 -0.421076 0.037507 0.040451 0.136051 -0.379901 -0.008535 0.100830 0.340456 0.039147 0.032518 -0.009147 -0.397240 -0.049823 0.105513 0.037496 0.382404 -0.117358 0.615559 0.044380 -0.009411 0.049897 -0.000135 0.039103 0.043212 -0.115352 0.005043 -0.022122 0.014162 0.026985 -0.015974 0.020797 -0.188922 0.031718 0.021692 0.371114 -0.102360
qa: -0.1589 0.2055 -0.1288 0.3367 0.1587 0.1443 -0.3475 0.2252 -0.0941 -0.3863 -0.1541 0.1508 0.1458 0.1919 0.1083 0.0524 -0.3639 0.1663 -0.2459 0.2516 -0.0860 0.2214 0.2417 0.2455 -0.2055 0.1410 0.1324 0.0363 -0.1247 -0.2438 -0.1255 0.1174 -0.1259 0.1348 0.1818 0.1392 0.1151 -0.2699 0.2168
va: 3.1853 1.0113 3.8928 4.1600 0.9999 1.0097 2.1619 4.1942 3.8548 2.1132 3.1954 1.0098 1.0104 1.0147 4.3553 3.7884 2.1213 1.0063 2.2202 1.0429 3.6647 0.9852 1.0690 0.9879 3.8527 1.0008 1.0124 3.5326 4.0311 4.0384 3.9918 1.0061 3.9624 1.0063 4.1085 1.0094 1.0065 2.2314 1.0259
dispcorr: -0.087805892 hartree
energy: -1047.229769128465
dipole: 0.98859 -0.57960 0.40899 -4.00513 2.95213 -1.05300 2.27702 -2.69514 -0.41812
magnitude: 1.20454 au
magnitude: 3.06169 debye
zeropoint: 0.32551110 hartree
thermalvibcorrection: 0.01679176 hartree
thermalrotcorrection: 0.00141627 hartree
thermaltrasncorrection: 0.00141627 hartree
thermaltotal: -1046.88463372 hartree
thermalcorr: 0.01962431 hartree
nonthermalcorr: 0.32551110 hartree
totalcorr: 0.34513541 hartree
totalenthalpy: -1046.88368951 hartree
