program: Orca
programVersion: 5.0.2
elementType: N H C C H H O C C O N H H H C C O H O H N H H H C H H C C C C H C H C H H O H
charge: 1
multiplicity: 1
keywords: wB97X-D3BJ Opt Freq def2-TZVPP def2/J RIJCOSX VeryTightSCF
keywords: PAL8 defgrid3 VeryTightOpt
frequency: 0.00 0.00 0.00 0.00 0.00 0.00 8.75 22.59 25.99 36.23 52.33 59.83 78.02 112.26 113.93 148.24 165.73 180.36 205.21 251.84 265.65 291.33 295.63 317.13 349.89 359.86 368.75 380.98 412.06 427.61 435.94 479.83 506.11 533.62 543.63 548.19 588.55 602.29 619.68 653.94 662.68 672.42 698.56 733.78 740.04 795.43 806.22 847.60 858.35 870.26 873.37 877.36 902.82 947.29 974.45 985.65 1014.14 1016.70 1029.50 1042.30 1058.13 1111.86 1126.36 1145.35 1147.15 1172.02 1193.43 1200.66 1210.75 1231.89 1253.46 1268.27 1279.59 1290.04 1332.11 1335.12 1337.59 1362.42 1367.36 1378.59 1391.68 1397.03 1412.59 1416.25 1474.22 1486.15 1495.40 1498.62 1543.39 1582.57 1590.28 1601.05 1617.57 1669.09 1672.85 1703.06 1730.66 1804.07 1888.16 3028.67 3065.62 3099.36 3115.96 3126.18 3143.04 3145.36 3170.04 3176.49 3188.54 3204.48 3230.98 3486.50 3566.26 3601.63 3656.59 3800.94 3877.25
frequency: 8.75 22.59 25.99 36.23 52.33 59.83 78.02 112.26 113.93 148.24 165.73 180.36 205.21 251.84 265.65 291.33 295.63 317.13 349.89 359.86 368.75 380.98 412.06 427.61 435.94 479.83 506.11 533.62 543.63 548.19 588.55 602.29 619.68 653.94 662.68 672.42 698.56 733.78 740.04 795.43 806.22 847.60 858.35 870.26 873.37 877.36 902.82 947.29 974.45 985.65 1014.14 1016.70 1029.50 1042.30 1058.13 1111.86 1126.36 1145.35 1147.15 1172.02 1193.43 1200.66 1210.75 1231.89 1253.46 1268.27 1279.59 1290.04 1332.11 1335.12 1337.59 1362.42 1367.36 1378.59 1391.68 1397.03 1412.59 1416.25 1474.22 1486.15 1495.40 1498.62 1543.39 1582.57 1590.28 1601.05 1617.57 1669.09 1672.85 1703.06 1730.66 1804.07 1888.16 3028.67 3065.62 3099.36 3115.96 3126.18 3143.04 3145.36 3170.04 3176.49 3188.54 3204.48 3230.98 3486.50 3566.26 3601.63 3656.59 3800.94 3877.25
formula: C13H18N3O5
InChI: InChI=1S/C13H18N3O5/c14-10(5-8-1-3-9(17)4-2-8)13(21)16-6-11(18)15-7-12(19)20/h1-4,10,15-17,19H,5-7H2,14H3
39 atoms
N  -1.586468 1.818322 2.848366
H  -2.133715 2.511544 2.363761
C  -1.60392 1.83311 4.300513
C  -2.593418 2.825831 4.875611
H  -1.861215 0.846546 4.688066
H  -0.619219 2.087147 4.699016
O  -2.782522 2.947079 6.04909
C  -0.858539 0.935702 2.166461
C  -0.933771 1.049057 0.63456
O  -0.172309 0.076012 2.727206
N  -0.146907 -0.001097 0.033215
H  -0.553308 2.022682 0.327042
H  -1.970147 0.96345 0.307431
H  -0.55972 -0.920966 0.067435
C  1.193299 0.064641 0.213416
C  1.958761 -1.25434 0.4261
O  1.809774 1.094557 0.394571
H  2.956737 -1.104588 0.015999
O  -3.220952 3.552707 3.928162
H  -3.821325 4.165121 4.374843
N  2.104284 -1.213535 1.936343
H  2.46785 -2.082833 2.3190
H  2.731033 -0.445245 2.17978
H  1.174926 -0.966459 2.355671
C  1.416887 -2.603938 -0.05483
H  2.180301 -3.353812 0.177515
H  1.383135 -2.547683 -1.144818
C  0.075288 -3.058009 0.476733
C  -0.077556 -3.528086 1.779124
C  -1.054998 -3.041736 -0.345043
C  -1.314527 -3.919554 2.267967
H  0.782199 -3.634308 2.434037
C  -2.298344 -3.427787 0.125497
H  -0.960341 -2.727504 -1.380038
C  -2.435873 -3.859646 1.443437
H  -1.405149 -4.286998 3.284511
H  -3.168747 -3.419903 -0.518395
O  -3.673578 -4.219154 1.852886
H  -3.651882 -4.549807 2.754602
totalener: -1047.13021661 hartree
nucrepener: 1744.39642925 hartree
electener: -2791.52664586 hartree
oneelecener: -4872.53926838 hartree
twoeener: 2081.01262252 hartree
kineticenergy: 1041.98806940 hartree
exchangeener: -91.589638980558 hartree
correlationener: -6.614445028096 hartree
xcener: -98.204084008654 hartree
temp: 298.15 k
press: 1.00 atm
thermalcorrenthalpy: 0.00094421 hartree
totalenthalpy: -1046.87222990 hartree
totalentropycorr: -0.06402411 hartree
gibbsenthalpy: -1046.93625400 hartree
gibbsminuselec: 0.27728723 hartree
totalenthalpy: -1046.87410551 hartree
totalenthalpy: -1046.87422301 hartree
chargesum: 1.0000000
charge: -0.179235 0.189153 -0.061104 0.294135 0.131468 0.132257 -0.271869 0.348409 -0.108741 -0.476578 -0.175175 0.159402 0.149655 0.171541 0.136495 -0.007289 -0.318409 0.181312 -0.291481 0.242635 -0.078109 0.214411 0.242545 0.249650 -0.225664 0.144539 0.134097 0.036975 -0.209856 -0.138907 -0.134461 0.112946 -0.156819 0.159031 0.192265 0.112948 0.148901 -0.268967 0.217896
charge: 0.345450 -0.016458 -0.022594 -0.431777 0.041348 0.041097 0.146814 -0.354254 -0.031215 0.083426 0.336637 0.041610 0.035283 -0.035363 -0.393206 -0.036639 0.115339 0.045711 0.349677 -0.076972 0.608216 0.034475 0.055326 -0.011673 -0.004334 0.040677 0.051147 -0.115769 -0.015307 -0.009041 -0.007349 0.015788 0.009116 0.029398 -0.190435 0.023029 0.032882 0.371730 -0.101787
qa: -0.1792 0.1892 -0.0611 0.2941 0.1315 0.1323 -0.2719 0.3484 -0.1087 -0.4766 -0.1752 0.1594 0.1497 0.1715 0.1365 -0.0073 -0.3184 0.1813 -0.2915 0.2426 -0.0781 0.2144 0.2425 0.2496 -0.2257 0.1445 0.1341 0.0370 -0.2099 -0.1389 -0.1345 0.1129 -0.1568 0.1590 0.1923 0.1129 0.1489 -0.2690 0.2179
va: 3.2270 1.0280 3.8415 4.3230 1.0095 1.0075 2.2378 4.0524 3.8638 2.0258 3.1955 1.0061 0.9963 1.0655 4.3872 3.8440 2.1957 1.0023 2.1584 1.0161 3.6190 0.9873 0.9812 1.0513 3.8394 0.9971 1.0074 3.5761 4.0620 3.9470 3.9858 1.0041 4.0206 0.9989 4.0921 1.0076 1.0071 2.2319 1.0252
dispcorr: -0.083650340 hartree
energy: -1047.219698993862
dipole: 6.63552 -4.94401 1.69152 -6.57434 5.55834 -1.01600 -4.12543 3.71068 -0.41475
magnitude: 2.01631 au
magnitude: 5.12505 debye
zeropoint: 0.32407306 hartree
thermalvibcorrection: 0.01763536 hartree
thermalrotcorrection: 0.00141627 hartree
thermaltrasncorrection: 0.00141627 hartree
thermaltotal: -1046.87515803 hartree
thermalcorr: 0.02046790 hartree
nonthermalcorr: 0.32407306 hartree
totalcorr: 0.34454097 hartree
totalenthalpy: -1046.87421382 hartree
