program: Orca
programVersion: 5.0.2
elementType: N H C C H H O C C O N H H H C C O H O H N H H H C H H C C C C H C H C H H O H
charge: 1
multiplicity: 1
keywords: wB97X-D3BJ Opt Freq def2-TZVPP def2/J RIJCOSX VeryTightSCF
keywords: PAL8 defgrid3 VeryTightOpt
frequency: 0.00 0.00 0.00 0.00 0.00 0.00 13.14 14.72 29.03 30.83 50.55 57.15 62.83 66.93 91.55 97.79 162.02 200.44 230.38 255.45 280.19 291.05 301.38 323.67 350.44 382.40 390.36 405.31 428.53 433.09 444.34 458.42 480.50 513.25 536.39 547.48 577.41 584.13 601.14 640.83 656.60 670.24 683.00 724.83 747.46 753.45 806.26 858.22 867.49 868.16 873.14 887.61 901.09 931.05 963.83 992.86 1028.90 1042.30 1046.88 1055.69 1061.56 1096.39 1122.74 1140.58 1148.36 1152.37 1194.26 1201.61 1214.26 1221.27 1251.09 1269.49 1285.84 1306.03 1309.92 1325.06 1334.97 1345.48 1374.85 1379.12 1392.09 1396.69 1402.63 1407.47 1464.22 1471.71 1477.93 1493.69 1501.71 1580.77 1584.88 1599.60 1611.57 1670.28 1672.79 1699.38 1774.96 1791.94 1875.92 3081.70 3096.73 3110.92 3120.64 3133.32 3147.46 3167.40 3176.18 3176.33 3197.03 3217.70 3231.84 3322.41 3569.51 3668.36 3680.19 3803.90 3876.05
frequency: 13.14 14.72 29.03 30.83 50.55 57.15 62.83 66.93 91.55 97.79 162.02 200.44 230.38 255.45 280.19 291.05 301.38 323.67 350.44 382.40 390.36 405.31 428.53 433.09 444.34 458.42 480.50 513.25 536.39 547.48 577.41 584.13 601.14 640.83 656.60 670.24 683.00 724.83 747.46 753.45 806.26 858.22 867.49 868.16 873.14 887.61 901.09 931.05 963.83 992.86 1028.90 1042.30 1046.88 1055.69 1061.56 1096.39 1122.74 1140.58 1148.36 1152.37 1194.26 1201.61 1214.26 1221.27 1251.09 1269.49 1285.84 1306.03 1309.92 1325.06 1334.97 1345.48 1374.85 1379.12 1392.09 1396.69 1402.63 1407.47 1464.22 1471.71 1477.93 1493.69 1501.71 1580.77 1584.88 1599.60 1611.57 1670.28 1672.79 1699.38 1774.96 1791.94 1875.92 3081.70 3096.73 3110.92 3120.64 3133.32 3147.46 3167.40 3176.18 3176.33 3197.03 3217.70 3231.84 3322.41 3569.51 3668.36 3680.19 3803.90 3876.05
formula: C13H18N3O5
InChI: InChI=1S/C13H18N3O5/c14-10(5-8-1-3-9(17)4-2-8)13(21)16-6-11(18)15-7-12(19)20/h1-4,10,15-17,19H,5-7H2,14H3
39 atoms
N  -1.751624 2.479388 2.379209
H  -1.988241 3.221438 1.743728
C  -2.31604 2.493097 3.710577
C  -3.575052 1.656383 3.885943
H  -1.588344 2.123352 4.430629
H  -2.563746 3.519546 3.982743
O  -4.000694 1.337606 4.958427
C  -1.167421 1.362701 1.902891
C  -0.746588 1.419265 0.430554
O  -0.976223 0.365692 2.575942
N  -0.040485 0.211278 0.061579
H  -0.096068 2.276296 0.25793
H  -1.629555 1.522087 -0.201513
H  -0.594044 -0.611352 -0.110317
C  1.243423 0.049634 0.399942
C  1.839279 -1.355753 0.194552
O  1.974552 0.943904 0.8046
H  1.71872 -1.636935 -0.851737
O  -4.173853 1.350884 2.71854
H  -4.97034 0.848594 2.936981
N  3.299209 -1.159268 0.465752
H  3.898916 -1.376278 -0.324843
H  3.362554 -0.143395 0.713555
H  3.574051 -1.714624 1.288107
C  1.246586 -2.445111 1.125017
H  1.358595 -3.413589 0.635384
H  0.177444 -2.256212 1.231895
C  1.916715 -2.473328 2.476719
C  1.581023 -1.555679 3.472238
C  2.943202 -3.388699 2.729052
C  2.25441 -1.551863 4.683105
H  0.774821 -0.849457 3.308159
C  3.627149 -3.389207 3.934527
H  3.195788 -4.136548 1.982025
C  3.282826 -2.464863 4.918537
H  1.973846 -0.841662 5.453884
H  4.411718 -4.10713 4.136986
O  3.977059 -2.50752 6.077617
H  3.638674 -1.858108 6.699569
totalener: -1047.14274325 hartree
nucrepener: 1714.50853260 hartree
electener: -2761.65127586 hartree
oneelecener: -4813.82651704 hartree
twoeener: 2052.17524118 hartree
kineticenergy: 1042.89366230 hartree
exchangeener: -91.748741998676 hartree
correlationener: -6.624066657263 hartree
xcener: -98.372808655939 hartree
temp: 298.15 k
press: 1.00 atm
thermalcorrenthalpy: 0.00094421 hartree
totalenthalpy: -1046.87941665 hartree
totalentropycorr: -0.06943219 hartree
gibbsenthalpy: -1046.94884884 hartree
gibbsminuselec: 0.27583442 hartree
chargesum: 1.0000000
charge: -0.208182 0.180619 -0.063619 0.290580 0.132128 0.127892 -0.283861 0.324847 -0.122155 -0.412680 -0.175217 0.143144 0.153764 0.182324 0.245906 -0.032432 -0.366053 0.162589 -0.282023 0.234171 -0.051879 0.229773 0.226874 0.231285 -0.182466 0.139293 0.130306 -0.039973 -0.131676 -0.228243 -0.133896 0.148719 -0.143656 0.156743 0.204659 0.116269 0.147076 -0.269560 0.218610
charge: 0.330931 -0.017403 -0.035262 -0.438247 0.041562 0.039420 0.133832 -0.388097 -0.026780 0.082091 0.350403 0.037857 0.034824 -0.009166 -0.368336 -0.029181 0.124362 0.037181 0.349974 -0.084677 0.615726 0.039324 0.008694 0.034426 0.004800 0.037138 0.039711 -0.120953 0.013036 -0.022952 -0.005129 0.025554 0.003731 0.024482 -0.189077 0.024009 0.031320 0.372122 -0.101250
qa: -0.2082 0.1806 -0.0636 0.2906 0.1321 0.1279 -0.2839 0.3248 -0.1222 -0.4127 -0.1752 0.1431 0.1538 0.1823 0.2459 -0.0324 -0.3661 0.1626 -0.2820 0.2342 -0.0519 0.2298 0.2269 0.2313 -0.1825 0.1393 0.1303 -0.0400 -0.1317 -0.2282 -0.1339 0.1487 -0.1437 0.1567 0.2047 0.1163 0.1471 -0.2696 0.2186
va: 3.1868 1.0132 3.8195 4.3043 1.0224 1.0006 2.2267 4.1198 3.8185 2.0911 3.3063 1.0107 0.9912 1.0156 4.2410 3.8706 2.1530 0.9969 2.1735 1.0217 3.6004 0.9776 1.0408 1.0155 3.8587 0.9996 1.0174 3.6136 3.9850 3.9876 3.9289 1.0421 4.0284 0.9960 4.0760 1.0063 1.0080 2.2324 1.0248
dispcorr: -0.081939573 hartree
energy: -1047.224682963638
dipole: 6.23886 -4.36429 1.87457 -2.85776 2.68032 -0.17744 -8.22535 4.46115 -3.76420
magnitude: 4.20888 au
magnitude: 10.69813 debye
zeropoint: 0.32367144 hartree
thermalvibcorrection: 0.01781870 hartree
thermalrotcorrection: 0.00141627 hartree
thermaltrasncorrection: 0.00141627 hartree
thermaltotal: -1046.88036028 hartree
thermalcorr: 0.02065124 hartree
nonthermalcorr: 0.32367144 hartree
totalcorr: 0.34432268 hartree
totalenthalpy: -1046.87941607 hartree
