program: Orca
programVersion: 5.0.2
elementType: N H C C H H O C C O N H H H C C O H O H N H H H C H H C C C C H C H C H H O H
charge: 1
multiplicity: 1
keywords: wB97X-D3BJ Opt Freq def2-TZVPP def2/J RIJCOSX VeryTightSCF
keywords: PAL8 defgrid3 VeryTightOpt
frequency: 0.00 0.00 0.00 0.00 0.00 0.00 20.71 30.67 59.98 65.73 91.98 106.41 130.02 143.90 148.28 159.75 185.97 199.08 226.64 264.69 283.36 288.61 311.65 340.26 359.80 369.58 375.46 385.99 406.84 429.10 436.19 478.99 483.31 508.64 536.69 561.55 592.53 626.03 651.60 658.74 676.25 693.29 723.00 737.92 763.91 794.98 804.42 857.55 858.97 864.23 869.56 878.32 900.22 915.97 951.72 986.37 1009.32 1030.94 1043.13 1045.57 1048.56 1087.45 1104.62 1123.03 1146.70 1157.59 1176.76 1194.08 1210.22 1228.50 1250.19 1253.79 1277.92 1290.45 1334.71 1336.08 1337.91 1345.13 1366.68 1375.04 1377.74 1400.20 1405.57 1414.64 1477.11 1477.81 1486.48 1498.86 1560.68 1577.59 1581.80 1582.84 1630.46 1665.90 1671.93 1702.05 1747.06 1774.04 1906.28 3068.64 3116.28 3122.66 3127.95 3146.68 3173.76 3177.24 3179.96 3187.42 3205.27 3233.24 3284.14 3333.82 3543.13 3589.88 3679.66 3763.54 3876.16
frequency: 20.71 30.67 59.98 65.73 91.98 106.41 130.02 143.90 148.28 159.75 185.97 199.08 226.64 264.69 283.36 288.61 311.65 340.26 359.80 369.58 375.46 385.99 406.84 429.10 436.19 478.99 483.31 508.64 536.69 561.55 592.53 626.03 651.60 658.74 676.25 693.29 723.00 737.92 763.91 794.98 804.42 857.55 858.97 864.23 869.56 878.32 900.22 915.97 951.72 986.37 1009.32 1030.94 1043.13 1045.57 1048.56 1087.45 1104.62 1123.03 1146.70 1157.59 1176.76 1194.08 1210.22 1228.50 1250.19 1253.79 1277.92 1290.45 1334.71 1336.08 1337.91 1345.13 1366.68 1375.04 1377.74 1400.20 1405.57 1414.64 1477.11 1477.81 1486.48 1498.86 1560.68 1577.59 1581.80 1582.84 1630.46 1665.90 1671.93 1702.05 1747.06 1774.04 1906.28 3068.64 3116.28 3122.66 3127.95 3146.68 3173.76 3177.24 3179.96 3187.42 3205.27 3233.24 3284.14 3333.82 3543.13 3589.88 3679.66 3763.54 3876.16
formula: C13H18N3O5
InChI: InChI=1S/C13H18N3O5/c14-10(5-8-1-3-9(17)4-2-8)13(21)16-6-11(18)15-7-12(19)20/h1-4,10,15-17,19H,5-7H2,14H3
39 atoms
N  0.443555 2.651327 2.229038
H  0.350498 3.444424 1.617829
C  1.105779 2.788427 3.515723
C  2.264509 1.804127 3.698376
H  1.49424 3.803774 3.604114
H  0.41899 2.60503 4.340489
O  2.55639 1.335906 4.75293
C  0.023203 1.438094 1.832758
C  -0.525657 1.277022 0.409651
O  0.16289 0.452325 2.550114
N  0.064376 0.051978 -0.112681
H  -0.277877 2.126914 -0.223745
H  -1.60828 1.161155 0.445534
H  -0.444739 -0.80152 0.066085
C  1.411055 -0.007133 -0.043933
C  2.091176 -1.349278 0.271987
O  2.11337 0.990875 -0.033198
H  3.090093 -1.288972 -0.158318
O  2.986117 1.485388 2.586968
H  2.64744 1.904297 1.782909
N  2.274915 -1.245938 1.773142
H  2.7462 -2.065022 2.151883
H  2.811823 -0.398456 2.022023
H  1.359914 -1.124466 2.233951
C  1.441916 -2.679426 -0.122797
H  2.15575 -3.470549 0.12827
H  1.372786 -2.677205 -1.212465
C  0.092145 -2.996342 0.481386
C  -1.066349 -2.931524 -0.290309
C  -0.035683 -3.391553 1.816298
C  -2.314509 -3.203297 0.254664
H  -0.998385 -2.673406 -1.342572
C  -1.269756 -3.661735 2.37647
H  0.8456 -3.535929 2.434679
C  -2.421918 -3.559683 1.596423
H  -3.200514 -3.154144 -0.36936
H  -1.362124 -3.972376 3.409336
O  -3.600288 -3.8348 2.197488
H  -4.3242 -3.790008 1.567393
totalener: -1047.12270508 hartree
nucrepener: 1821.65886316 hartree
electener: -2868.78156825 hartree
oneelecener: -5026.15032640 hartree
twoeener: 2157.36875815 hartree
kineticenergy: 1041.98503795 hartree
exchangeener: -91.588173980623 hartree
correlationener: -6.621722176682 hartree
xcener: -98.209896157305 hartree
temp: 298.15 k
press: 1.00 atm
thermalcorrenthalpy: 0.00094421 hartree
totalenthalpy: -1046.87011902 hartree
totalentropycorr: -0.06196748 hartree
gibbsenthalpy: -1046.93208649 hartree
gibbsminuselec: 0.27963775 hartree
totalenthalpy: -1046.87255366 hartree
chargesum: 1.0000000
charge: -0.198425 0.204031 -0.070342 0.270129 0.141971 0.146013 -0.247126 0.237684 -0.065390 -0.430077 -0.156796 0.127918 0.141407 0.191174 0.124028 0.028119 -0.364959 0.182925 -0.283235 0.236386 -0.079400 0.226318 0.255430 0.251180 -0.214723 0.146790 0.133667 0.031383 -0.181102 -0.206693 -0.146266 0.158366 -0.123119 0.127150 0.186081 0.122753 0.144827 -0.266369 0.218289
charge: 0.337303 -0.013739 -0.028827 -0.442222 0.040066 0.044170 0.162445 -0.385234 -0.018554 0.085509 0.344778 0.031688 0.038661 -0.031280 -0.381933 -0.035725 0.107421 0.048657 0.367262 -0.123657 0.612290 0.043902 0.027561 0.030197 -0.002547 0.041838 0.050704 -0.118388 -0.011079 -0.016496 -0.012366 0.028461 0.018461 0.018010 -0.188690 0.023816 0.033777 0.374481 -0.100720
qa: -0.1984 0.2040 -0.0703 0.2701 0.1420 0.1460 -0.2471 0.2377 -0.0654 -0.4301 -0.1568 0.1279 0.1414 0.1912 0.1240 0.0281 -0.3650 0.1829 -0.2832 0.2364 -0.0794 0.2263 0.2554 0.2512 -0.2147 0.1468 0.1337 0.0314 -0.1811 -0.2067 -0.1463 0.1584 -0.1231 0.1272 0.1861 0.1228 0.1448 -0.2664 0.2183
va: 3.1631 0.9953 3.7754 4.2990 0.9944 1.0169 2.2662 4.1385 3.8564 2.0725 3.2089 1.0151 1.0000 1.0529 4.3465 3.8205 2.1281 1.0019 2.1487 1.0314 3.6213 0.9773 1.0184 1.0087 3.8358 0.9984 1.0078 3.5607 3.9872 4.0399 3.9488 1.0013 4.0444 0.9994 4.1117 1.0051 1.0086 2.2366 1.0248
dispcorr: -0.088975377 hartree
energy: -1047.218287362741
dipole: -0.33971 0.11907 -0.22064 -2.45631 2.70382 0.24751 -5.03600 3.30538 -1.73062
magnitude: 1.76210 au
magnitude: 4.47890 debye
zeropoint: 0.32513594 hartree
thermalvibcorrection: 0.01682153 hartree
thermalrotcorrection: 0.00141627 hartree
thermaltrasncorrection: 0.00141627 hartree
thermaltotal: -1046.87349735 hartree
thermalcorr: 0.01965407 hartree
nonthermalcorr: 0.32513594 hartree
totalcorr: 0.34479001 hartree
totalenthalpy: -1046.87255314 hartree
