program: Orca
programVersion: 5.0.2
elementType: N H C C H H O C C O N H H H C C O H O H N H H H C H H C C C C H C H C H H O H
charge: 1
multiplicity: 1
keywords: wB97X-D3BJ Opt Freq def2-TZVPP def2/J RIJCOSX VeryTightSCF
keywords: PAL8 defgrid3 VeryTightOpt
frequency: 0.00 0.00 0.00 0.00 0.00 0.00 23.51 29.18 35.15 56.55 58.61 65.05 89.11 104.11 117.60 154.67 180.44 189.23 208.91 240.54 268.85 287.06 293.40 309.32 350.42 356.12 365.27 382.54 400.54 428.94 434.74 471.56 492.75 506.43 515.84 532.18 552.93 607.82 617.78 659.09 665.65 689.84 731.71 747.31 769.87 800.86 816.08 834.57 857.21 871.36 875.78 883.93 896.89 919.31 959.25 983.77 1010.58 1027.48 1042.40 1043.76 1061.09 1087.33 1112.92 1141.29 1148.94 1159.08 1198.99 1203.39 1208.74 1239.17 1248.86 1268.42 1289.99 1304.25 1311.38 1326.79 1332.19 1346.43 1348.86 1374.32 1388.88 1398.48 1418.46 1450.20 1469.27 1489.08 1490.97 1499.74 1540.37 1560.97 1575.80 1581.16 1637.72 1658.98 1674.54 1701.96 1764.13 1800.78 1831.90 3078.04 3106.22 3121.69 3132.87 3154.42 3165.92 3184.80 3187.70 3193.76 3205.32 3229.16 3289.27 3455.97 3518.94 3648.16 3691.49 3801.93 3877.16
frequency: 23.51 29.18 35.15 56.55 58.61 65.05 89.11 104.11 117.60 154.67 180.44 189.23 208.91 240.54 268.85 287.06 293.40 309.32 350.42 356.12 365.27 382.54 400.54 428.94 434.74 471.56 492.75 506.43 515.84 532.18 552.93 607.82 617.78 659.09 665.65 689.84 731.71 747.31 769.87 800.86 816.08 834.57 857.21 871.36 875.78 883.93 896.89 919.31 959.25 983.77 1010.58 1027.48 1042.40 1043.76 1061.09 1087.33 1112.92 1141.29 1148.94 1159.08 1198.99 1203.39 1208.74 1239.17 1248.86 1268.42 1289.99 1304.25 1311.38 1326.79 1332.19 1346.43 1348.86 1374.32 1388.88 1398.48 1418.46 1450.20 1469.27 1489.08 1490.97 1499.74 1540.37 1560.97 1575.80 1581.16 1637.72 1658.98 1674.54 1701.96 1764.13 1800.78 1831.90 3078.04 3106.22 3121.69 3132.87 3154.42 3165.92 3184.80 3187.70 3193.76 3205.32 3229.16 3289.27 3455.97 3518.94 3648.16 3691.49 3801.93 3877.16
formula: C13H18N3O5
InChI: InChI=1S/C13H18N3O5/c14-10(5-8-1-3-9(17)4-2-8)13(21)16-6-11(18)15-7-12(19)20/h1-4,10,15-17,19H,5-7H2,14H3
39 atoms
N  -1.983883 0.052857 2.497276
H  -2.7636 0.193089 1.879629
C  -2.138004 -0.800971 3.645269
C  -1.464858 -2.151802 3.457429
H  -1.694582 -0.343559 4.532411
H  -3.194879 -0.963188 3.854037
O  -0.771747 -2.478306 2.515715
C  -0.753569 0.485163 2.140675
C  -0.614248 1.066374 0.734225
O  0.227869 0.284477 2.840338
N  0.105226 0.039155 -0.014383
H  -0.006352 1.967484 0.761272
H  -1.569475 1.283078 0.257024
H  -0.378595 -0.840688 -0.096136
C  1.461911 -0.025603 0.145398
C  2.065152 -1.433259 0.25751
O  2.17592 0.931386 0.320406
H  3.128313 -1.335124 0.043557
O  -1.727893 -2.951352 4.481795
H  -1.287887 -3.802086 4.348863
N  1.960312 -1.751984 1.731547
H  2.463487 -2.620146 1.925297
H  2.329921 -0.982256 2.293116
H  0.976688 -1.882674 2.018578
C  1.461116 -2.585196 -0.541384
H  1.560768 -2.342446 -1.600931
H  0.393981 -2.686868 -0.325778
C  2.158154 -3.884377 -0.207238
C  1.586723 -4.789178 0.6887
C  3.411537 -4.180008 -0.738944
C  2.244604 -5.954224 1.049885
H  0.601088 -4.588698 1.098777
C  4.079844 -5.343069 -0.389734
H  3.872969 -3.5014 -1.449509
C  3.497614 -6.235544 0.509643
H  1.797955 -6.665189 1.733503
H  5.05006 -5.562665 -0.822555
O  4.09336 -7.388357 0.893148
H  4.933932 -7.501892 0.4421
totalener: -1047.13495888 hartree
nucrepener: 1747.18816960 hartree
electener: -2794.32312849 hartree
oneelecener: -4877.90195087 hartree
twoeener: 2083.57882239 hartree
kineticenergy: 1041.99861987 hartree
exchangeener: -91.589156424861 hartree
correlationener: -6.614064903319 hartree
xcener: -98.203221328181 hartree
temp: 298.15 k
press: 1.00 atm
thermalcorrenthalpy: 0.00094421 hartree
totalenthalpy: -1046.87695488 hartree
totalentropycorr: -0.06368848 hartree
gibbsenthalpy: -1046.94064336 hartree
gibbsminuselec: 0.27859199 hartree
totalenthalpy: -1046.87925793 hartree
chargesum: 1.0000000
charge: -0.179963 0.187708 -0.066753 0.349219 0.149576 0.150936 -0.405051 0.218731 -0.055638 -0.414092 -0.156355 0.148068 0.121148 0.162948 0.125500 0.013090 -0.273959 0.174497 -0.224624 0.241077 -0.068539 0.234664 0.251073 0.230306 -0.171082 0.145936 0.103948 -0.012888 -0.204752 -0.181720 -0.118359 0.128968 -0.134192 0.139886 0.190254 0.138044 0.116413 -0.272333 0.218313
charge: 0.335867 -0.018082 -0.034406 -0.409288 0.049416 0.043927 0.083017 -0.383559 -0.019952 0.070561 0.321604 0.043756 0.023628 -0.033942 -0.394957 -0.041593 0.144325 0.047834 0.405350 -0.074486 0.616231 0.045844 0.056500 0.014593 -0.005689 0.047071 0.029017 -0.114151 -0.021072 0.000433 0.001317 0.020828 -0.007902 0.029226 -0.190876 0.028825 0.023575 0.369124 -0.101917
qa: -0.1800 0.1877 -0.0668 0.3492 0.1496 0.1509 -0.4051 0.2187 -0.0556 -0.4141 -0.1564 0.1481 0.1211 0.1629 0.1255 0.0131 -0.2740 0.1745 -0.2246 0.2411 -0.0685 0.2347 0.2511 0.2303 -0.1711 0.1459 0.1039 -0.0129 -0.2048 -0.1817 -0.1184 0.1290 -0.1342 0.1399 0.1903 0.1380 0.1164 -0.2723 0.2183
va: 3.1742 1.0071 3.8263 4.2279 1.0097 1.0052 2.0726 4.2239 3.8195 2.0806 3.1685 1.0287 1.0043 1.0338 4.3831 3.7875 2.2316 1.0137 2.2792 1.0168 3.6386 0.9824 0.9727 1.0585 3.8436 1.0066 1.0156 3.5843 3.9405 4.0518 3.9842 1.0181 3.9405 1.0030 4.1018 1.0093 1.0068 2.2283 1.0250
dispcorr: -0.084734075 hartree
energy: -1047.225216522443
dipole: -1.09238 -0.06333 -1.15572 -0.68481 0.38972 -0.29509 -2.33114 2.65578 0.32463
magnitude: 1.23618 au
magnitude: 3.14212 debye
zeropoint: 0.32464452 hartree
thermalvibcorrection: 0.01753309 hartree
thermalrotcorrection: 0.00141627 hartree
thermaltrasncorrection: 0.00141627 hartree
thermaltotal: -1046.88020637 hartree
thermalcorr: 0.02036563 hartree
nonthermalcorr: 0.32464452 hartree
totalcorr: 0.34501015 hartree
totalenthalpy: -1046.87926216 hartree
