program: Orca
programVersion: 5.0.2
elementType: N H C C H H O C C O N H H H C C O H O H N H H H C H H C C C C H C H C H H O H
charge: 1
multiplicity: 1
keywords: wB97X-D3BJ Opt Freq def2-TZVPP def2/J RIJCOSX VeryTightSCF
keywords: PAL8 defgrid3 VeryTightOpt
frequency: 0.00 0.00 0.00 0.00 0.00 0.00 6.92 18.56 28.29 36.33 43.71 59.59 64.87 81.99 99.09 112.47 152.81 181.61 189.54 218.10 232.25 292.63 306.57 326.13 354.51 382.30 388.81 404.11 430.98 437.26 440.01 476.33 491.91 524.33 529.23 569.03 582.80 598.87 613.95 622.88 653.32 660.12 672.84 713.34 743.63 749.34 825.14 861.34 866.56 870.61 883.08 911.42 925.27 976.91 988.02 992.93 1012.27 1018.17 1035.67 1041.84 1055.43 1110.00 1122.26 1134.39 1148.22 1167.78 1195.14 1200.42 1212.85 1226.35 1249.22 1259.83 1265.85 1270.28 1300.52 1326.94 1335.92 1344.08 1358.46 1375.49 1385.78 1394.73 1398.80 1420.54 1453.43 1497.07 1497.41 1503.80 1507.48 1581.56 1586.42 1603.83 1610.42 1670.94 1678.08 1700.61 1765.28 1779.82 1886.82 3072.67 3090.44 3090.49 3094.33 3124.78 3138.42 3140.55 3144.68 3165.84 3194.09 3209.26 3231.98 3365.16 3570.60 3585.19 3667.10 3803.43 3877.36
frequency: 6.92 18.56 28.29 36.33 43.71 59.59 64.87 81.99 99.09 112.47 152.81 181.61 189.54 218.10 232.25 292.63 306.57 326.13 354.51 382.30 388.81 404.11 430.98 437.26 440.01 476.33 491.91 524.33 529.23 569.03 582.80 598.87 613.95 622.88 653.32 660.12 672.84 713.34 743.63 749.34 825.14 861.34 866.56 870.61 883.08 911.42 925.27 976.91 988.02 992.93 1012.27 1018.17 1035.67 1041.84 1055.43 1110.00 1122.26 1134.39 1148.22 1167.78 1195.14 1200.42 1212.85 1226.35 1249.22 1259.83 1265.85 1270.28 1300.52 1326.94 1335.92 1344.08 1358.46 1375.49 1385.78 1394.73 1398.80 1420.54 1453.43 1497.07 1497.41 1503.80 1507.48 1581.56 1586.42 1603.83 1610.42 1670.94 1678.08 1700.61 1765.28 1779.82 1886.82 3072.67 3090.44 3090.49 3094.33 3124.78 3138.42 3140.55 3144.68 3165.84 3194.09 3209.26 3231.98 3365.16 3570.60 3585.19 3667.10 3803.43 3877.36
formula: C13H18N3O5
InChI: InChI=1S/C13H18N3O5/c14-10(5-8-1-3-9(17)4-2-8)13(21)16-6-11(18)15-7-12(19)20/h1-4,10,15-17,19H,5-7H2,14H3
39 atoms
N  -3.013409 1.624432 1.140472
H  -2.878047 2.564791 0.808064
C  -4.238885 1.321784 1.857743
C  -5.032914 2.55682 2.226561
H  -4.894316 0.679084 1.264338
H  -4.016118 0.780473 2.777575
O  -6.010322 2.524858 2.913643
C  -2.096044 0.676156 0.911144
C  -0.848924 1.124153 0.145908
O  -2.211219 -0.485754 1.276866
N  -0.020567 -0.051631 -0.024469
H  -0.301479 1.881884 0.708985
H  -1.128323 1.555187 -0.818325
H  -0.513743 -0.916915 0.154712
C  1.305218 -0.005647 0.006241
C  2.050981 -1.35799 -0.028944
O  1.976842 1.022052 0.018007
H  1.997836 -1.742335 -1.048902
O  -4.531758 3.688205 1.684516
H  -5.105829 4.418422 1.952475
N  3.471069 -0.958481 0.234195
H  4.147235 -1.4143 -0.37152
H  3.455914 0.080308 0.093253
H  3.700551 -1.144387 1.218363
C  1.586246 -2.418574 0.981517
H  2.096169 -3.357059 0.751749
H  0.523195 -2.607333 0.824543
C  1.864977 -2.005031 2.405277
C  3.051908 -2.39562 3.031767
C  0.978947 -1.1944 3.114014
C  3.366405 -1.972282 4.313298
H  3.729162 -3.081563 2.52795
C  1.277383 -0.771296 4.399185
H  0.028473 -0.91238 2.673634
C  2.477614 -1.149454 5.001229
H  4.279437 -2.286693 4.80266
H  0.570143 -0.154263 4.943404
O  2.828546 -0.765765 6.248784
H  2.135691 -0.234411 6.649431
totalener: -1047.13842607 hartree
nucrepener: 1666.16616470 hartree
electener: -2713.30459076 hartree
oneelecener: -4716.74647387 hartree
twoeener: 2003.44188311 hartree
kineticenergy: 1041.97432651 hartree
exchangeener: -91.588429907333 hartree
correlationener: -6.613567053023 hartree
xcener: -98.201996960356 hartree
temp: 298.15 k
press: 1.00 atm
thermalcorrenthalpy: 0.00094421 hartree
totalenthalpy: -1046.87812514 hartree
totalentropycorr: -0.06460835 hartree
gibbsenthalpy: -1046.94273349 hartree
gibbsminuselec: 0.27604923 hartree
totalenthalpy: -1046.87983177 hartree
chargesum: 1.0000000
charge: -0.195920 0.182187 -0.058616 0.293700 0.134309 0.134295 -0.274346 0.284836 -0.097617 -0.405979 -0.169639 0.141582 0.140443 0.184883 0.242626 -0.011336 -0.375698 0.157576 -0.294273 0.239668 -0.054973 0.229577 0.229430 0.225300 -0.230707 0.141611 0.133123 0.070770 -0.258859 -0.166632 -0.124271 0.161172 -0.122500 0.116961 0.186490 0.147844 0.113190 -0.268230 0.218022
charge: 0.332510 -0.022949 -0.023979 -0.430569 0.042199 0.042374 0.144145 -0.387999 -0.017805 0.072316 0.355107 0.036492 0.032846 -0.025379 -0.374872 -0.031246 0.111192 0.040770 0.345583 -0.079975 0.614823 0.039942 0.006018 0.038890 -0.001045 0.040238 0.041824 -0.114113 -0.026528 0.007659 0.008056 0.023033 -0.004153 0.025862 -0.188350 0.032051 0.023143 0.373252 -0.101361
qa: -0.1959 0.1822 -0.0586 0.2937 0.1343 0.1343 -0.2743 0.2848 -0.0976 -0.4060 -0.1696 0.1416 0.1404 0.1849 0.2426 -0.0113 -0.3757 0.1576 -0.2943 0.2397 -0.0550 0.2296 0.2294 0.2253 -0.2307 0.1416 0.1331 0.0708 -0.2589 -0.1666 -0.1243 0.1612 -0.1225 0.1170 0.1865 0.1478 0.1132 -0.2682 0.2180
va: 3.1938 1.0313 3.8354 4.3141 1.0064 1.0118 2.2356 4.1976 3.8546 2.0927 3.2705 1.0105 0.9983 1.0441 4.2471 3.9248 2.1515 0.9962 2.1506 1.0185 3.5837 0.9768 1.0423 1.0184 3.8986 1.0036 1.0104 3.4765 3.9933 4.0445 4.0332 0.9970 3.9385 1.0378 4.1075 1.0074 1.0055 2.2335 1.0253
dispcorr: -0.080921217 hartree
energy: -1047.224661135106
dipole: 9.75783 -6.47719 3.28063 -5.84894 5.28941 -0.55953 -5.21277 2.83419 -2.37857
magnitude: 4.09063 au
magnitude: 10.39755 debye
zeropoint: 0.32315635 hartree
thermalvibcorrection: 0.01790931 hartree
thermalrotcorrection: 0.00141627 hartree
thermaltrasncorrection: 0.00141627 hartree
thermaltotal: -1046.88076294 hartree
thermalcorr: 0.02074185 hartree
nonthermalcorr: 0.32315635 hartree
totalcorr: 0.34389819 hartree
totalenthalpy: -1046.87981873 hartree
