program: Gaussian 09
title: 000048436
version: EM64L-G09RevD.01
frameworkgroup: C1[X(C11H16N2O3)]
method: RPBEPBE
basis: SDD
operation: Freq
keyword: #p
keyword: freq=noraman
keyword: PBEPBE/SDD
title: #p freq=noraman PBEPBE/SDD
converged: NO YES NO NO
title: Mulliken charges:
elementType: O O O N N C C C C C C C C C C C H H H H H H H H H H H H H H H H
charge: -0.199629 -0.194133 -0.232320 -0.197463 -0.377296 -0.027711 -0.437094 0.165786 0.533473 0.100801 -0.726203 0.199877 -0.314612 -0.837253 -0.700931 -0.672777 0.246560 0.246356 0.228426 0.229646 0.230530 0.360933 0.248256 0.248946 0.242455 0.241359 0.237956 0.217955 0.236373 0.238376 0.236130 0.227229
chargesum: 0.00000
title: Mulliken charges with hydrogens summed into heavy atoms:
elementType: O O O N N C C C C C C C C C C C
charge: -0.199629 -0.194133 -0.232320 -0.197463 -0.016363 -0.027711 0.055822 0.165786 0.533473 0.100801 -0.037601 0.199877 0.182589 -0.115484 -0.246603 0.028958
polarizability: 1.69086215e+02 1.16112328e+01 1.30143622e+02 -4.25084396e+00 -7.19673056e+00 1.15981473e+02
1716.lowfreq: -13.5348 -10.5517 0.0002 0.0005 0.0010 11.4204 21.3629 30.0290 55.8418
frequency: 19.7856 29.7468 55.6855 58.1486 108.0540 142.6732 149.4015 163.1859 163.7983 173.8430 193.2025 199.8733 212.9118 303.4207 323.4910 345.3903 354.9811 357.3838 393.3123 410.5637 435.3525 479.9489 484.5884 500.2794 569.0641 651.9849 660.8705 675.8357 693.4002 705.5922 728.7369 773.4840 777.9644 788.0966 832.5268 905.7754 943.8279 952.0897 962.0206 978.2313 993.4757 1012.9259 1055.7819 1069.4696 1086.0954 1094.9216 1128.4137 1148.1043 1173.0786 1216.6500 1232.5346 1282.2802 1298.0688 1324.4103 1333.2866 1358.4997 1378.6519 1380.9077 1391.4942 1399.3646 1402.4855 1426.4927 1453.6748 1458.1178 1468.5802 1472.9262 1474.8121 1479.9476 1481.1870 1487.3113 1584.3078 1642.4909 1652.2422 1672.3242 2966.9572 2981.1763 2992.9130 3019.7871 3039.1581 3048.9643 3065.1476 3081.7415 3090.5490 3092.0399 3092.7937 3095.6477 3110.0004 3122.1541 3212.8547 3511.6168
redmass: 2.6081 5.5945 2.8807 3.8156 2.5856 4.6019 8.8130 2.9687 3.0940 1.2955 4.0854 1.2629 1.0962 1.8546 4.0341 5.8035 3.1419 3.1271 6.5388 6.8314 4.0282 3.7568 4.3719 3.0050 5.9245 1.9284 2.7475 3.5379 3.5672 3.4908 2.8710 1.5382 1.3748 1.5086 2.3073 3.1122 1.4985 1.8010 1.8631 2.0664 2.2567 1.6037 1.5304 2.6602 3.2147 2.0135 2.9622 3.2067 2.7573 2.8536 3.1694 1.8766 1.5283 1.5335 1.9071 1.6051 1.8447 2.0308 1.2966 1.2074 1.2101 1.1830 1.0992 1.0849 1.0491 1.0450 1.0666 1.0500 1.0508 1.0419 11.3249 5.8191 7.9406 5.2915 1.0384 1.0364 1.0354 1.0594 1.0972 1.0604 1.1004 1.0981 1.1013 1.0973 1.0982 1.1043 1.0647 1.1061 1.1125 1.0766
irintensity: 0.0086 1.1769 0.2984 0.2768 0.0459 0.4464 10.9337 1.6190 3.2516 0.2504 1.0369 0.8482 0.1669 1.5037 6.3558 23.6039 1.7587 9.5917 6.6454 1.9832 5.9482 14.4315 2.9280 12.7440 3.1242 3.4174 12.3683 3.3221 0.8587 0.6774 7.3579 86.3889 9.3938 28.4036 18.5115 7.5713 45.7051 5.4003 7.2535 1.6825 5.0557 3.2005 0.2810 19.0683 1.1297 15.9975 5.9006 1.6071 31.0293 34.7117 56.1790 125.3827 89.7435 26.4815 152.8313 94.0021 97.3170 75.2213 12.0381 18.3417 14.0125 8.8536 42.6591 33.5879 7.2434 28.2675 13.7591 9.5232 11.4645 14.1550 309.9299 333.6633 198.7469 19.7200 20.1342 21.6068 16.9524 10.7560 17.0701 10.6372 11.6100 34.4056 15.9366 33.4104 22.5668 17.1635 6.1109 6.1594 12.3417 61.9073
temp: 298.150 k
press: 1.00000 atm
elementType: 8 8 8 7 7 6 6 6 6 6 6 6 6 6 6 6 1 1 1 1 1 1 1 1 1 1 1 1 1 1 1 1
symmnumber: 1
zpe: 680061.1 jmol-1
zpe.correction: 0.259022 hartree
zpe.thermalcorrener: 0.276149 hartree
zpe.thermalcorrenthalpy: 0.277093 hartree
zpe.thermalcorrgfe: 0.213283 hartree
zpe.sumelectzpe: -762.752124 hartree
zpe.sumelectthermal: -762.734997 hartree
zpe.sumelectthermalent: -762.734053 hartree
zpe.sumelectthermalfe: -762.797863 hartree
dipole: 0.4875 -0.9536 0.1277
dipole: 1.0786
quadrupole: -99.4336 -100.4914 -94.2935
quadrupole: -0.2504 -0.9714 7.7398
quadrupole: -1.3608 -2.4185 3.7793 -0.2504 -0.9714 7.7398
hfenergy: -763.011146 hartree
pointgroup: C01 [X(C11H16N2O3)]
dipole: -0.1632888 0.391578 -0.0088407 debye
polarizability: 169.6085865|8.6480188|130.060848|8.2415771|5.9301671|115.5418762 unknown
InChI: InChI=1S/C11H16N2O3/c1-5-11(7(3)4)8(14)12-10(16)13(6-2)9(11)15/h12H,3,5-6H2,1-2,4H3
charge 0 multiplicity 1
32 atoms
O  -0.328351 1.777988 1.264763
O  1.942328 -2.071572 -0.662617
O  -2.664709 -1.683979 -0.820838
N  -1.501072 0.067828 0.22629
N  -0.346813 -1.794094 -0.728813
C  1.058565 0.038285 0.252368
C  1.878923 -0.128902 1.572713
C  -0.29491 0.695005 0.62421
C  1.744387 0.975395 -0.787003
C  0.944854 -1.35141 -0.405759
C  1.208039 -1.053084 2.610902
C  -1.576841 -1.160469 -0.466103
C  -2.790939 0.753347 0.542801
C  0.98622 1.180584 -2.088623
C  2.939782 1.568762 -0.554326
C  -3.198019 1.74982 -0.558029
H  2.017338 0.877642 2.004193
H  2.867228 -0.536496 1.296922
H  1.843789 -1.12879 3.51069
H  0.225474 -0.663268 2.934964
H  1.068331 -2.078149 2.220853
H  -0.422838 -2.704424 -1.195778
H  -3.553244 -0.033139 0.658312
H  -2.644261 1.274059 1.502551
H  0.830739 0.225521 -2.627292
H  -0.012939 1.626073 -1.915033
H  1.540533 1.855836 -2.760773
H  3.391754 2.220408 -1.310822
H  3.505612 1.436453 0.371441
H  -2.43608 2.539502 -0.677609
H  -3.344673 1.234704 -1.523139
H  -4.150908 2.236265 -0.282813
