program: Orca
programVersion: 5.0.2
elementType: N H C C H H O C C O N H H H C C O H O H N H H H C H H C C C C H C H C H H O H
charge: 1
multiplicity: 1
keywords: wB97X-D3BJ Opt Freq def2-TZVPP def2/J RIJCOSX VeryTightSCF
keywords: PAL8 defgrid3 VeryTightOpt
frequency: 0.00 0.00 0.00 0.00 0.00 0.00 12.72 22.01 31.08 34.58 55.11 57.60 64.27 85.83 120.22 133.28 165.83 173.04 193.86 253.74 282.33 292.14 309.27 332.12 345.00 362.33 382.77 387.97 406.39 428.90 436.50 489.03 505.99 522.49 541.86 546.97 567.58 598.11 610.69 617.63 659.22 671.93 696.07 733.92 751.19 787.99 810.55 847.60 857.80 869.24 875.18 885.08 907.93 965.62 982.80 983.03 1009.89 1016.08 1041.66 1049.58 1060.23 1106.37 1126.34 1143.95 1155.00 1167.52 1199.10 1200.51 1207.84 1247.80 1268.30 1268.87 1276.38 1281.98 1310.63 1324.38 1333.74 1348.17 1361.17 1372.16 1390.25 1394.19 1410.77 1414.79 1475.76 1495.21 1495.65 1503.06 1507.37 1570.39 1580.87 1598.75 1622.44 1673.01 1679.69 1701.16 1730.03 1805.07 1888.93 3071.93 3101.12 3118.19 3124.94 3141.51 3145.10 3171.89 3178.08 3186.65 3200.48 3205.29 3231.56 3443.05 3528.31 3655.14 3671.13 3800.71 3876.96
frequency: 12.72 22.01 31.08 34.58 55.11 57.60 64.27 85.83 120.22 133.28 165.83 173.04 193.86 253.74 282.33 292.14 309.27 332.12 345.00 362.33 382.77 387.97 406.39 428.90 436.50 489.03 505.99 522.49 541.86 546.97 567.58 598.11 610.69 617.63 659.22 671.93 696.07 733.92 751.19 787.99 810.55 847.60 857.80 869.24 875.18 885.08 907.93 965.62 982.80 983.03 1009.89 1016.08 1041.66 1049.58 1060.23 1106.37 1126.34 1143.95 1155.00 1167.52 1199.10 1200.51 1207.84 1247.80 1268.30 1268.87 1276.38 1281.98 1310.63 1324.38 1333.74 1348.17 1361.17 1372.16 1390.25 1394.19 1410.77 1414.79 1475.76 1495.21 1495.65 1503.06 1507.37 1570.39 1580.87 1598.75 1622.44 1673.01 1679.69 1701.16 1730.03 1805.07 1888.93 3071.93 3101.12 3118.19 3124.94 3141.51 3145.10 3171.89 3178.08 3186.65 3200.48 3205.29 3231.56 3443.05 3528.31 3655.14 3671.13 3800.71 3876.96
formula: C13H18N3O5
InChI: InChI=1S/C13H18N3O5/c14-10(5-8-1-3-9(17)4-2-8)13(21)16-6-11(18)15-7-12(19)20/h1-4,10,15-17,19H,5-7H2,14H3
39 atoms
N  -0.998865 1.905255 2.982414
H  -1.602098 2.589141 2.554067
C  -0.792844 1.987557 4.4182
C  -1.59585 3.092322 5.074278
H  -1.069653 1.04839 4.900018
H  0.259053 2.167831 4.648065
O  -1.564175 3.306273 6.249133
C  -0.400363 0.97375 2.242395
C  -0.706259 1.019141 0.732898
O  0.348236 0.12083 2.726829
N  -0.024209 -0.07362 0.075661
H  -0.363708 1.969343 0.324417
H  -1.779875 0.938381 0.563371
H  -0.462396 -0.973788 0.172384
C  1.331327 -0.050044 0.154655
C  2.066479 -1.379055 0.379754
O  1.989146 0.968511 0.202422
H  2.903275 -1.4381 -0.315737
O  -2.336912 3.798276 4.195289
H  -2.81114 4.480724 4.689687
N  2.653035 -1.150827 1.75187
H  3.078799 -2.011957 2.103648
H  3.33694 -0.395189 1.707519
H  1.883165 -0.830767 2.371446
C  1.279308 -2.686626 0.39109
H  0.872429 -2.844006 -0.610512
H  0.439737 -2.608016 1.08774
C  2.16399 -3.840234 0.804251
C  3.091019 -4.385296 -0.081875
C  2.114467 -4.344303 2.105021
C  3.947063 -5.400142 0.314606
H  3.141154 -4.025323 -1.104823
C  2.96731 -5.355809 2.517744
H  1.379166 -3.958866 2.806061
C  3.890511 -5.887851 1.620367
H  4.654974 -5.820195 -0.391969
H  2.921048 -5.755307 3.522889
O  4.697345 -6.873792 2.072976
H  5.272572 -7.191791 1.372307
totalener: -1047.13815436 hartree
nucrepener: 1647.84014017 hartree
electener: -2694.97829453 hartree
oneelecener: -4679.78310119 hartree
twoeener: 1984.80480666 hartree
kineticenergy: 1041.98614972 hartree
exchangeener: -91.589326449749 hartree
correlationener: -6.612685025250 hartree
xcener: -98.202011474999 hartree
temp: 298.15 k
press: 1.00 atm
thermalcorrenthalpy: 0.00094421 hartree
totalenthalpy: -1046.87723208 hartree
totalentropycorr: -0.06440894 hartree
gibbsenthalpy: -1046.94164102 hartree
gibbsminuselec: 0.27742977 hartree
totalenthalpy: -1046.87904458 hartree
chargesum: 1.0000000
charge: -0.178451 0.189070 -0.061533 0.293914 0.134272 0.131436 -0.270625 0.338815 -0.109953 -0.486355 -0.158822 0.155036 0.151763 0.176925 0.143374 0.045470 -0.324290 0.170750 -0.292005 0.242821 -0.077668 0.232664 0.240665 0.248770 -0.208656 0.147063 0.113909 -0.000379 -0.177005 -0.236637 -0.139815 0.136671 -0.127518 0.147401 0.197075 0.116805 0.145807 -0.269012 0.218247
charge: 0.344787 -0.016747 -0.022007 -0.431641 0.041903 0.040991 0.147914 -0.360022 -0.030615 0.061029 0.328693 0.041525 0.034603 -0.024042 -0.387981 -0.038916 0.116845 0.045262 0.349395 -0.076819 0.617473 0.040002 0.051567 0.010067 -0.011812 0.044117 0.032418 -0.116151 -0.000674 -0.020879 -0.006174 0.028238 0.006801 0.024307 -0.189894 0.023904 0.031787 0.372097 -0.101351
qa: -0.1785 0.1891 -0.0615 0.2939 0.1343 0.1314 -0.2706 0.3388 -0.1100 -0.4864 -0.1588 0.1550 0.1518 0.1769 0.1434 0.0455 -0.3243 0.1708 -0.2920 0.2428 -0.0777 0.2327 0.2407 0.2488 -0.2087 0.1471 0.1139 -0.0004 -0.1770 -0.2366 -0.1398 0.1367 -0.1275 0.1474 0.1971 0.1168 0.1458 -0.2690 0.2182
va: 3.2147 1.0282 3.8416 4.3215 1.0081 1.0085 2.2389 4.0731 3.8774 2.0086 3.2071 1.0061 0.9956 1.0174 4.3848 3.7811 2.1846 1.0072 2.1577 1.0160 3.6290 0.9903 0.9843 1.0293 3.8494 1.0022 1.0188 3.5799 4.0508 3.9716 3.9516 1.0043 3.9990 1.0002 4.0909 1.0069 1.0076 2.2324 1.0251
dispcorr: -0.081487771 hartree
energy: -1047.224757165779
dipole: 1.96970 -1.80399 0.16570 -5.37396 5.06129 -0.31267 -5.22793 3.72544 -1.50248
magnitude: 1.54359 au
magnitude: 3.92350 debye
zeropoint: 0.32423214 hartree
thermalvibcorrection: 0.01769958 hartree
thermalrotcorrection: 0.00141627 hartree
thermaltrasncorrection: 0.00141627 hartree
thermaltotal: -1046.87999290 hartree
thermalcorr: 0.02053212 hartree
nonthermalcorr: 0.32423214 hartree
totalcorr: 0.34476426 hartree
totalenthalpy: -1046.87904870 hartree
