program: Orca
programVersion: 5.0.2
elementType: N H C C H H O C C O N H H H C C O H O H N H H H C H H C C C C H C H C H H O H
charge: 1
multiplicity: 1
keywords: wB97X-D3BJ Opt Freq def2-TZVPP def2/J RIJCOSX VeryTightSCF
keywords: PAL8 defgrid3 VeryTightOpt
frequency: 0.00 0.00 0.00 0.00 0.00 0.00 26.95 42.87 47.84 70.07 75.21 92.50 98.00 125.05 126.33 142.60 162.17 190.12 221.45 246.18 259.65 298.34 332.00 349.40 370.54 374.54 397.75 402.36 411.35 425.45 437.60 478.58 490.29 522.13 530.15 537.52 546.66 600.94 619.81 625.74 660.75 674.91 703.73 745.75 755.14 799.15 813.96 847.97 852.54 873.04 887.54 891.15 904.63 917.55 940.10 981.33 1016.44 1020.00 1040.93 1044.99 1065.44 1083.88 1108.85 1149.14 1153.60 1162.52 1189.68 1203.20 1209.87 1223.13 1244.92 1252.70 1297.59 1316.16 1320.69 1324.15 1338.60 1346.83 1353.93 1371.42 1391.95 1400.52 1406.58 1452.76 1464.35 1488.45 1496.54 1501.63 1511.79 1579.29 1581.56 1590.72 1625.61 1647.35 1675.53 1702.73 1762.86 1793.75 1810.57 3086.11 3112.00 3112.99 3127.50 3136.47 3171.84 3176.33 3201.66 3202.15 3223.18 3236.60 3292.12 3392.63 3566.86 3662.83 3693.57 3798.76 3872.06
frequency: 26.95 42.87 47.84 70.07 75.21 92.50 98.00 125.05 126.33 142.60 162.17 190.12 221.45 246.18 259.65 298.34 332.00 349.40 370.54 374.54 397.75 402.36 411.35 425.45 437.60 478.58 490.29 522.13 530.15 537.52 546.66 600.94 619.81 625.74 660.75 674.91 703.73 745.75 755.14 799.15 813.96 847.97 852.54 873.04 887.54 891.15 904.63 917.55 940.10 981.33 1016.44 1020.00 1040.93 1044.99 1065.44 1083.88 1108.85 1149.14 1153.60 1162.52 1189.68 1203.20 1209.87 1223.13 1244.92 1252.70 1297.59 1316.16 1320.69 1324.15 1338.60 1346.83 1353.93 1371.42 1391.95 1400.52 1406.58 1452.76 1464.35 1488.45 1496.54 1501.63 1511.79 1579.29 1581.56 1590.72 1625.61 1647.35 1675.53 1702.73 1762.86 1793.75 1810.57 3086.11 3112.00 3112.99 3127.50 3136.47 3171.84 3176.33 3201.66 3202.15 3223.18 3236.60 3292.12 3392.63 3566.86 3662.83 3693.57 3798.76 3872.06
formula: C13H18N3O5
InChI: InChI=1S/C13H18N3O5/c14-10(5-8-1-3-9(17)4-2-8)13(21)16-6-11(18)15-7-12(19)20/h1-4,10,15-17,19H,5-7H2,14H3
39 atoms
N  0.434697 2.255127 2.221715
H  1.111395 2.548186 1.536309
C  0.822513 2.225725 3.607605
C  1.656381 1.000268 3.949802
H  1.413274 3.110595 3.852262
H  -0.063179 2.229493 4.240136
O  2.270908 0.335452 3.143026
C  -0.577736 1.452257 1.804376
C  -0.690279 1.261979 0.290552
O  -1.29872 0.833463 2.563356
N  0.019781 0.018252 -0.012344
H  -1.737193 1.146326 0.022674
H  -0.247344 2.073566 -0.28274
H  -0.478238 -0.840813 0.139706
C  1.357319 0.007854 0.002451
C  2.095808 -1.343942 0.051484
O  2.048871 1.017117 -0.029903
H  2.461102 -1.524896 -0.961938
O  1.652827 0.761551 5.25307
H  2.164726 -0.037047 5.441635
N  3.29738 -1.010675 0.887465
H  4.030684 -1.711783 0.825274
H  3.625037 -0.091121 0.565441
H  3.010474 -0.884337 1.872477
C  1.385893 -2.599895 0.582331
H  1.951232 -3.466964 0.232416
H  0.412169 -2.679992 0.094735
C  1.268775 -2.654347 2.08771
C  2.275829 -3.267339 2.830036
C  0.209985 -2.063314 2.776569
C  2.262884 -3.251429 4.217579
H  3.084489 -3.786377 2.32236
C  0.177507 -2.042733 4.158737
H  -0.609985 -1.593271 2.248809
C  1.218343 -2.617882 4.883543
H  3.05815 -3.733026 4.776691
H  -0.641582 -1.570753 4.686416
O  1.174953 -2.500485 6.23797
H  1.835522 -3.065381 6.647953
totalener: -1047.13607328 hartree
nucrepener: 1896.22747311 hartree
electener: -2943.36354639 hartree
oneelecener: -5176.03496885 hartree
twoeener: 2232.67142246 hartree
kineticenergy: 1042.02171953 hartree
exchangeener: -91.598222932908 hartree
correlationener: -6.623098772015 hartree
xcener: -98.221321704923 hartree
temp: 298.15 k
press: 1.00 atm
thermalcorrenthalpy: 0.00094421 hartree
totalenthalpy: -1046.88520880 hartree
totalentropycorr: -0.06198118 hartree
gibbsenthalpy: -1046.94718998 hartree
gibbsminuselec: 0.28032117 hartree
totalenthalpy: -1046.88815260 hartree
chargesum: 1.0000000
charge: -0.175957 0.188439 -0.078484 0.346735 0.143104 0.146448 -0.408053 0.251006 -0.112894 -0.366773 -0.161124 0.149413 0.142166 0.193419 0.224008 0.029166 -0.408644 0.166682 -0.229471 0.242464 -0.065811 0.222771 0.232954 0.262181 -0.266811 0.147684 0.128221 0.104862 -0.256807 -0.134265 -0.085897 0.134720 -0.122396 0.110019 0.084883 0.120565 0.159936 -0.281567 0.223108
charge: 0.331999 -0.022133 -0.035943 -0.411214 0.041696 0.045558 0.091828 -0.391319 -0.009818 0.095044 0.355075 0.037667 0.031201 -0.020980 -0.382460 -0.032688 0.091025 0.045523 0.410562 -0.079416 0.615907 0.041472 0.037930 0.019028 -0.003020 0.041916 0.037808 -0.111596 -0.018546 0.006137 -0.020297 0.021168 0.011564 0.020187 -0.205584 0.022221 0.036530 0.359471 -0.103502
qa: -0.1760 0.1884 -0.0785 0.3467 0.1431 0.1464 -0.4081 0.2510 -0.1129 -0.3668 -0.1611 0.1494 0.1422 0.1934 0.2240 0.0292 -0.4086 0.1667 -0.2295 0.2425 -0.0658 0.2228 0.2330 0.2622 -0.2668 0.1477 0.1282 0.1049 -0.2568 -0.1343 -0.0859 0.1347 -0.1224 0.1100 0.0849 0.1206 0.1599 -0.2816 0.2231
va: 3.1866 1.0215 3.8787 4.2033 0.9989 1.0196 2.0671 4.1685 3.8620 2.1455 3.2526 1.0099 1.0098 1.0126 4.2951 3.8539 2.0984 0.9923 2.2734 1.0199 3.6416 0.9791 1.0118 1.0087 3.8984 0.9993 1.0090 3.3711 4.0712 4.0121 3.9531 1.0034 3.9184 1.0414 4.0657 1.0045 1.0099 2.1971 1.0204
dispcorr: -0.090354550 hartree
energy: -1047.234194281344
dipole: 3.93406 -1.36626 2.56780 -4.06667 3.03146 -1.03521 -5.76838 4.02422 -1.74416
magnitude: 3.27220 au
magnitude: 8.31728 debye
zeropoint: 0.32513167 hartree
thermalvibcorrection: 0.01712116 hartree
thermalrotcorrection: 0.00141627 hartree
thermaltrasncorrection: 0.00141627 hartree
thermaltotal: -1046.88910890 hartree
thermalcorr: 0.01995371 hartree
nonthermalcorr: 0.32513167 hartree
totalcorr: 0.34508538 hartree
totalenthalpy: -1046.88816469 hartree
