program: Orca
programVersion: 5.0.2
elementType: N H C C H H O C C O N H H H C C O H O H N H H H C H H C C C C H C H C H H O H
charge: 1
multiplicity: 1
keywords: wB97X-D3BJ Opt Freq def2-TZVPP def2/J RIJCOSX VeryTightSCF
keywords: PAL8 defgrid3 VeryTightOpt
frequency: 0.00 0.00 0.00 0.00 0.00 0.00 15.21 23.45 33.01 38.07 56.69 75.93 77.22 90.98 110.85 141.42 153.20 193.85 222.90 257.08 268.38 299.46 314.60 327.24 347.86 361.38 378.59 393.76 408.97 427.05 434.66 460.60 490.38 516.26 527.61 546.22 554.06 569.96 630.88 658.69 672.23 674.32 705.23 744.18 765.73 799.50 813.96 844.80 851.85 873.31 882.49 887.65 900.54 961.76 966.75 985.96 1010.98 1018.06 1032.46 1042.80 1065.40 1082.98 1116.05 1140.16 1159.15 1166.26 1198.50 1206.82 1208.84 1234.25 1248.12 1248.61 1297.14 1302.62 1319.09 1331.50 1338.16 1349.82 1361.98 1369.75 1383.14 1389.60 1431.47 1447.86 1467.44 1488.83 1495.74 1500.58 1504.50 1578.99 1581.69 1600.69 1608.82 1675.86 1680.42 1702.99 1764.71 1791.37 1810.53 3063.54 3109.82 3116.00 3133.86 3145.25 3167.46 3179.11 3193.85 3202.89 3203.34 3231.24 3264.01 3392.32 3557.95 3655.77 3661.64 3804.39 3878.90
frequency: 15.21 23.45 33.01 38.07 56.69 75.93 77.22 90.98 110.85 141.42 153.20 193.85 222.90 257.08 268.38 299.46 314.60 327.24 347.86 361.38 378.59 393.76 408.97 427.05 434.66 460.60 490.38 516.26 527.61 546.22 554.06 569.96 630.88 658.69 672.23 674.32 705.23 744.18 765.73 799.50 813.96 844.80 851.85 873.31 882.49 887.65 900.54 961.76 966.75 985.96 1010.98 1018.06 1032.46 1042.80 1065.40 1082.98 1116.05 1140.16 1159.15 1166.26 1198.50 1206.82 1208.84 1234.25 1248.12 1248.61 1297.14 1302.62 1319.09 1331.50 1338.16 1349.82 1361.98 1369.75 1383.14 1389.60 1431.47 1447.86 1467.44 1488.83 1495.74 1500.58 1504.50 1578.99 1581.69 1600.69 1608.82 1675.86 1680.42 1702.99 1764.71 1791.37 1810.53 3063.54 3109.82 3116.00 3133.86 3145.25 3167.46 3179.11 3193.85 3202.89 3203.34 3231.24 3264.01 3392.32 3557.95 3655.77 3661.64 3804.39 3878.90
formula: C13H18N3O5
InChI: InChI=1S/C13H18N3O5/c14-10(5-8-1-3-9(17)4-2-8)13(21)16-6-11(18)15-7-12(19)20/h1-4,10,15-17,19H,5-7H2,14H3
39 atoms
N  0.538874 2.052957 -2.340536
H  1.174733 2.310231 -1.603266
C  1.035238 1.95759 -3.684254
C  1.772486 0.655706 -3.950854
H  0.21071 2.027581 -4.392865
H  1.724379 2.7772 -3.897419
O  2.148329 -0.129249 -3.10041
C  -0.579238 1.349882 -2.0013
C  -0.797179 1.174104 -0.498078
O  -1.292422 0.803029 -2.815354
N  -0.080437 -0.04876 -0.141822
H  -1.856897 1.03774 -0.301335
H  -0.410708 2.002117 0.093397
H  -0.555318 -0.927274 -0.271703
C  1.246934 -0.04636 -0.012501
C  1.956452 -1.404848 -0.057407
O  1.940158 0.959146 0.102775
H  1.423885 -2.10832 -0.696641
O  1.991038 0.478928 -5.243932
H  2.472125 -0.348113 -5.382399
N  3.255092 -1.076655 -0.734114
H  3.940775 -1.823119 -0.649524
H  3.070725 -0.844933 -1.725044
H  3.59361 -0.211124 -0.294506
C  2.19186 -1.996455 1.333818
H  2.755545 -1.278602 1.935573
H  2.7982 -2.902203 1.235145
C  0.871012 -2.312105 1.992677
C  0.318347 -1.444484 2.933208
C  0.149687 -3.444327 1.626521
C  -0.920808 -1.69488 3.494722
H  0.866391 -0.558131 3.235946
C  -1.096215 -3.708065 2.17781
H  0.565439 -4.147639 0.910767
C  -1.635681 -2.830328 3.116036
H  -1.348053 -1.028776 4.23354
H  -1.641183 -4.60103 1.890571
O  -2.842794 -3.0253 3.697188
H  -3.233689 -3.849656 3.396799
totalener: -1047.14399362 hartree
nucrepener: 1751.97546018 hartree
electener: -2799.11945380 hartree
oneelecener: -4888.02801644 hartree
twoeener: 2088.90856264 hartree
kineticenergy: 1042.00649241 hartree
exchangeener: -91.596792736803 hartree
correlationener: -6.615186944764 hartree
xcener: -98.211979681567 hartree
temp: 298.15 k
press: 1.00 atm
thermalcorrenthalpy: 0.00094421 hartree
totalenthalpy: -1046.88546290 hartree
totalentropycorr: -0.06372047 hartree
gibbsenthalpy: -1046.94918337 hartree
gibbsminuselec: 0.27827868 hartree
totalenthalpy: -1046.88779660 hartree
chargesum: 1.0000000
charge: -0.192148 0.186184 -0.085319 0.363533 0.151932 0.146310 -0.427203 0.244402 -0.125627 -0.344941 -0.119670 0.145836 0.145772 0.198597 0.197596 0.016231 -0.415143 0.155452 -0.220280 0.237460 -0.076733 0.224052 0.251180 0.229526 -0.150307 0.131544 0.120742 -0.017959 -0.123113 -0.215246 -0.143402 0.129142 -0.133102 0.125437 0.190426 0.141089 0.113365 -0.271771 0.216159
charge: 0.324699 -0.027301 -0.040984 -0.394684 0.049077 0.042581 0.084930 -0.390264 -0.010384 0.101663 0.364258 0.037908 0.031003 -0.003132 -0.391162 -0.046203 0.078452 0.038566 0.410897 -0.075603 0.612130 0.041262 -0.000481 0.040347 -0.003520 0.040898 0.033823 -0.109641 0.003344 -0.011577 0.007611 0.028049 -0.016316 0.024072 -0.191263 0.030879 0.021324 0.368307 -0.103563
qa: -0.1921 0.1862 -0.0853 0.3635 0.1519 0.1463 -0.4272 0.2444 -0.1256 -0.3449 -0.1197 0.1458 0.1458 0.1986 0.1976 0.0162 -0.4151 0.1555 -0.2203 0.2375 -0.0767 0.2241 0.2512 0.2295 -0.1503 0.1315 0.1207 -0.0180 -0.1231 -0.2152 -0.1434 0.1291 -0.1331 0.1254 0.1904 0.1411 0.1134 -0.2718 0.2162
va: 3.1474 1.0236 3.8553 4.1763 1.0205 1.0024 2.0344 4.2165 3.8444 2.1760 3.2378 1.0099 1.0089 1.0049 4.2999 3.8247 2.0977 1.0076 2.2839 1.0199 3.6233 0.9780 1.0290 1.0116 3.8387 1.0116 1.0070 3.6353 3.9955 4.0261 3.9955 1.0034 3.9398 1.0069 4.0809 1.0086 1.0069 2.2273 1.0263
dispcorr: -0.083795430 hartree
energy: -1047.233682301490
dipole: 5.87174 -2.83867 3.03307 -3.19956 2.09825 -1.10131 2.73873 -3.66556 -0.92683
magnitude: 3.35729 au
magnitude: 8.53356 debye
zeropoint: 0.32453142 hartree
thermalvibcorrection: 0.01757545 hartree
thermalrotcorrection: 0.00141627 hartree
thermaltrasncorrection: 0.00141627 hartree
thermaltotal: -1046.88874289 hartree
thermalcorr: 0.02040799 hartree
nonthermalcorr: 0.32453142 hartree
totalcorr: 0.34493941 hartree
totalenthalpy: -1046.88779868 hartree
