program: Gaussian 09
title: 000047330
version: EM64L-G09RevD.01
frameworkgroup: C1[X(C19H18N2O4)]
method: RPBEPBE
basis: SDD
operation: Freq
keyword: #p
keyword: freq=noraman
keyword: PBEPBE/SDD
title: #p freq=noraman PBEPBE/SDD
converged: YES YES NO NO
title: Mulliken charges:
elementType: O O O O N N C C C C C C C C C C C C C C C C C C C H H H H H H H H H H H H H H H H H H
charge: -0.279237 -0.284322 -0.222439 -0.303250 -0.393945 0.010141 -0.185489 -0.614195 0.490558 0.247813 -0.383811 -0.414608 0.303569 -0.235446 -0.233783 -0.475933 -0.241518 0.464761 -0.377314 -0.384635 -0.301307 -0.230027 -0.227017 -0.233776 -0.095238 0.300362 0.273574 0.247222 0.368159 0.248515 0.245377 0.231580 0.227794 0.224318 0.245950 0.229979 0.273149 0.234932 0.276000 0.283426 0.230529 0.228437 0.231146
chargesum: 0.00000
title: Mulliken charges with hydrogens summed into heavy atoms:
elementType: O O O O N N C C C C C C C C C C C C C C C C C C C
charge: -0.279237 -0.284322 -0.222439 -0.303250 -0.025786 0.010141 0.114872 -0.093399 0.490558 0.247813 -0.135296 -0.169231 0.303569 -0.003866 -0.005989 -0.005665 -0.011539 0.464761 -0.104165 -0.149703 0.258118 0.000502 0.001420 -0.002629 -0.095238
polarizability: 2.41464821e+02 -1.64288339e+01 2.09097130e+02 1.32680824e+01 -6.22683141e+00 1.98934156e+02
1716.lowfreq: -7.2022 -3.9266 -0.0006 -0.0005 -0.0003 3.2878 4.5832 7.5070 16.5214
frequency: 3.7198 7.3680 16.4609 24.5575 30.4718 38.1631 48.8850 58.6433 68.8561 87.9466 97.9302 112.6151 154.6069 167.8045 186.3264 231.2718 245.7506 258.5055 286.7271 308.8826 344.9816 350.1692 362.9700 390.2841 403.4458 406.2715 421.4930 482.4574 486.4885 507.4585 566.5376 580.4529 593.5959 595.3195 616.5540 617.2254 623.2282 661.2485 700.0327 705.9942 708.7977 727.1956 752.9234 759.4797 779.4575 815.0087 826.3075 857.0112 860.6415 865.9088 902.4625 911.3743 927.7059 936.9477 951.9958 962.8355 971.0460 980.2950 983.3462 989.3351 989.3715 994.9477 997.3354 1001.9135 1013.5873 1026.5793 1026.8868 1079.7000 1091.0421 1127.5535 1130.7888 1172.6392 1173.6044 1188.9153 1189.7857 1193.1957 1204.8190 1219.7272 1225.9830 1231.9059 1236.5161 1241.2890 1308.4538 1330.0805 1330.5370 1338.9920 1341.4531 1350.7106 1381.9582 1384.7199 1440.3516 1440.5895 1441.9315 1463.3476 1471.8366 1477.0841 1484.2506 1485.1505 1591.0938 1593.6862 1613.4940 1614.2481 1643.4667 1663.4124 2210.1722 3009.2557 3016.9824 3020.3270 3038.7105 3080.5024 3096.4134 3113.4256 3114.9275 3121.0440 3123.4873 3128.3130 3133.7672 3140.3596 3145.2032 3151.2429 3162.5635 3164.9703 3572.7338
redmass: 5.9293 7.6775 4.8529 6.1670 5.1455 4.5695 4.3226 8.4216 7.4538 9.4349 5.3394 5.1335 5.9616 5.3037 5.6195 5.1702 7.7718 7.1393 5.9519 5.4567 3.6067 2.9105 2.2725 3.5735 2.8302 2.8385 3.5492 4.0581 4.9188 4.9751 4.1706 2.1928 5.9006 1.8431 6.1522 6.1667 4.1055 5.3457 4.5202 1.9348 2.5814 2.5216 3.5012 2.2231 3.3086 3.4366 3.3962 1.2915 1.2536 4.6766 4.5573 3.3552 1.6276 1.4884 2.7924 2.5672 2.6447 1.3862 1.4611 4.6692 5.8992 3.2674 1.4422 1.3227 2.3242 2.2183 2.2055 1.6703 1.5207 3.0478 2.4695 1.0559 1.0543 1.1382 1.2192 1.5275 1.8189 2.8692 1.7194 1.1299 1.1595 1.4336 1.5069 1.2566 1.2631 1.3333 1.3214 1.3293 7.4065 8.0598 1.3616 1.5544 2.1685 1.1587 1.1168 1.9955 2.2672 2.2591 5.9626 6.0620 6.0871 6.0496 9.4702 10.6185 12.4294 1.0746 1.0588 1.0682 1.0590 1.1037 1.1030 1.1071 1.0870 1.0863 1.0867 1.0876 1.0918 1.0921 1.0961 1.0964 1.1015 1.1016 1.0778
irintensity: 0.8068 2.4456 0.7012 1.8874 0.2780 0.4389 0.8359 3.4596 1.5014 7.3086 1.5151 0.6777 1.7186 0.3543 0.3096 1.3288 10.0087 5.8463 8.1362 17.8216 1.4568 8.3546 1.6521 11.2188 0.0260 0.1019 0.2407 12.8082 5.5313 16.5916 10.1765 70.2674 5.5240 83.9374 0.4346 0.4889 1.1843 0.7513 33.0115 56.2625 37.0599 55.5121 18.0580 62.3343 2.7332 10.3956 8.0340 3.1896 0.5053 19.6359 27.6238 13.9279 8.3841 8.2211 3.0520 127.4386 90.0936 1.7517 5.4068 21.4972 4.8748 108.5891 20.1291 1.2611 39.1019 2.7110 5.6463 70.1176 7.1035 26.0961 165.8523 0.5472 0.0737 9.0062 5.2621 23.4502 165.5545 22.2275 22.0030 6.1980 7.2695 26.8232 30.4926 1.9134 0.6508 19.7299 11.8768 8.4379 0.9784 0.6105 26.0859 5.9856 9.6204 10.0023 20.2372 470.9128 7.3385 67.9491 1.1844 2.1477 3.8401 0.6319 235.8585 139.4546 0.3223 9.0206 19.1989 17.7625 36.5818 4.4669 1.9889 5.3809 4.8870 4.3195 1.0495 1.9402 12.9265 17.2791 35.6012 24.3238 17.8056 20.3688 77.1632
temp: 298.150 k
press: 1.00000 atm
elementType: 8 8 8 8 7 7 6 6 6 6 6 6 6 6 6 6 6 6 6 6 6 6 6 6 6 1 1 1 1 1 1 1 1 1 1 1 1 1 1 1 1 1 1
symmnumber: 1
zpe: 872168.1 jmol-1
zpe.correction: 0.332191 hartree
zpe.thermalcorrener: 0.355622 hartree
zpe.thermalcorrenthalpy: 0.356566 hartree
zpe.thermalcorrgfe: 0.271151 hartree
zpe.sumelectzpe: -1143.422195 hartree
zpe.sumelectthermal: -1143.398765 hartree
zpe.sumelectthermalent: -1143.397820 hartree
zpe.sumelectthermalfe: -1143.483235 hartree
dipole: -1.7052 3.6725 -1.9557
dipole: 4.4966
quadrupole: -143.7707 -151.4671 -145.5650
quadrupole: 14.8917 4.6072 -6.4670
quadrupole: 3.1636 -4.5328 1.3693 14.8917 4.6072 -6.4670
hfenergy: -1143.7543862 hartree
pointgroup: C01 [X(C19H18N2O4)]
dipole: 0.2669818 -0.85733 -1.5242883 debye
polarizability: 230.609541|-14.6509241|206.0265947|-20.0832106|14.1077406|212.8599708 unknown
InChI: InChI=1S/C19H18N2O4/c20-11-12-24-18(22)17(13-15-7-3-1-4-8-15)21-19(23)25-14-16-9-5-2-6-10-16/h1-10,17,21H,12-14H2
charge 0 multiplicity 1
43 atoms
O  -2.629511 1.836349 0.490657
O  1.866357 1.411029 0.932943
O  -3.880697 0.53206 1.975516
O  1.267717 -0.190861 2.569976
N  -0.320591 0.871146 1.215971
N  -3.858562 5.066496 0.836634
C  -1.456221 0.15872 1.799818
C  -1.537662 -1.356484 1.364423
C  -1.711251 -1.553941 -0.130941
C  -2.780371 0.8408 1.47909
C  -0.58474 -1.575354 -0.994893
C  -3.005616 -1.698935 -0.697595
C  0.95626 0.621368 1.654286
C  -0.747884 -1.727375 -2.39041
C  -3.171138 -1.853487 -2.09277
C  3.31822 1.128566 1.206065
C  -2.041908 -1.864282 -2.944575
C  3.846006 0.046248 0.288654
C  3.736783 -1.321155 0.65502
C  4.444605 0.383418 -0.951914
C  -3.873319 2.522087 0.051795
C  4.212135 -2.33159 -0.210093
C  4.921981 -0.626339 -1.817187
C  4.805511 -1.986865 -1.447763
C  -3.857973 3.925538 0.491114
H  -1.349769 0.155367 2.902124
H  -0.601491 -1.817829 1.724862
H  -2.377553 -1.805825 1.92393
H  -0.474499 1.521818 0.44466
H  0.423898 -1.48552 -0.573848
H  -3.884314 -1.70602 -0.040069
H  0.133397 -1.745531 -3.041347
H  -4.175996 -1.976639 -2.512968
H  3.797517 2.101579 1.016824
H  3.413436 0.849256 2.269353
H  -2.168247 -1.989143 -4.025927
H  3.271816 -1.580279 1.612999
H  4.533369 1.438206 -1.240045
H  -3.885815 2.459509 -1.048472
H  -4.747603 1.994755 0.477415
H  4.12578 -3.384335 0.081286
H  5.385806 -0.35506 -2.772125
H  5.178336 -2.771163 -2.116273
