program: Orca
programVersion: 5.0.2
elementType: N H C C H H O C C O N H H H C C O H O H N H H H C H H C C C C H C H C H H O H
charge: 1
multiplicity: 1
keywords: wB97X-D3BJ Opt Freq def2-TZVPP def2/J RIJCOSX VeryTightSCF
keywords: PAL8 defgrid3 VeryTightOpt
frequency: 0.00 0.00 0.00 0.00 0.00 0.00 22.27 56.85 63.14 84.29 86.73 100.10 118.09 125.55 141.06 160.85 186.61 213.90 221.35 251.51 271.54 285.18 300.92 313.14 350.71 387.63 417.27 426.16 436.99 454.96 467.08 483.77 502.74 529.91 569.84 584.59 595.33 613.35 640.01 655.09 674.13 687.08 738.16 746.70 793.45 819.22 831.93 843.83 866.52 871.30 875.41 887.29 902.34 928.66 970.17 988.53 1011.76 1037.43 1042.30 1046.71 1058.02 1104.90 1110.80 1115.99 1135.16 1154.81 1217.07 1239.47 1254.68 1261.42 1265.03 1284.49 1298.74 1317.21 1333.29 1338.16 1349.66 1359.96 1386.03 1393.86 1397.33 1399.40 1406.43 1444.37 1447.61 1466.57 1488.55 1496.28 1504.82 1579.70 1585.84 1598.65 1645.06 1666.47 1671.33 1699.57 1755.81 1777.99 1837.34 2982.53 3056.81 3105.84 3114.05 3121.43 3129.87 3182.86 3189.08 3192.29 3201.61 3228.09 3232.65 3509.53 3521.60 3571.91 3610.03 3655.48 3675.86
frequency: 22.27 56.85 63.14 84.29 86.73 100.10 118.09 125.55 141.06 160.85 186.61 213.90 221.35 251.51 271.54 285.18 300.92 313.14 350.71 387.63 417.27 426.16 436.99 454.96 467.08 483.77 502.74 529.91 569.84 584.59 595.33 613.35 640.01 655.09 674.13 687.08 738.16 746.70 793.45 819.22 831.93 843.83 866.52 871.30 875.41 887.29 902.34 928.66 970.17 988.53 1011.76 1037.43 1042.30 1046.71 1058.02 1104.90 1110.80 1115.99 1135.16 1154.81 1217.07 1239.47 1254.68 1261.42 1265.03 1284.49 1298.74 1317.21 1333.29 1338.16 1349.66 1359.96 1386.03 1393.86 1397.33 1399.40 1406.43 1444.37 1447.61 1466.57 1488.55 1496.28 1504.82 1579.70 1585.84 1598.65 1645.06 1666.47 1671.33 1699.57 1755.81 1777.99 1837.34 2982.53 3056.81 3105.84 3114.05 3121.43 3129.87 3182.86 3189.08 3192.29 3201.61 3228.09 3232.65 3509.53 3521.60 3571.91 3610.03 3655.48 3675.86
formula: C13H18N3O5
InChI: InChI=1S/C13H18N3O5/c14-10(5-8-1-3-9(17)4-2-8)13(21)16-6-11(18)15-7-12(19)20/h1-4,10,15-17,19H,5-7H2,14H3
39 atoms
N  -0.923002 1.274574 2.381434
H  -0.595554 0.32237 2.384451
C  -1.279408 1.888727 3.654493
C  -0.155537 2.763313 4.217286
H  -2.166548 2.508228 3.506989
H  -1.508622 1.107133 4.37202
O  0.408856 2.518317 5.257748
C  -0.974379 1.985465 1.24117
C  -0.756362 1.257678 -0.082341
O  -1.237827 3.17951 1.216736
N  0.000684 0.014197 -0.013467
H  -0.245872 1.955923 -0.742513
H  -1.737981 1.043914 -0.505994
H  -0.485048 -0.866306 -0.033076
C  1.334646 0.032981 0.023869
C  2.075679 -1.32143 -0.018944
O  2.007265 1.055478 0.063698
H  1.949591 -1.75509 -1.011673
O  0.173483 3.815463 3.485566
H  -0.380354 3.858899 2.679316
N  3.522731 -0.915545 0.094595
H  4.084244 -1.219708 -0.697379
H  3.462508 0.137402 0.11277
H  3.95452 -1.257055 0.950904
C  1.656352 -2.331162 1.055168
H  2.451964 -3.07932 1.147706
H  0.801287 -2.885503 0.662701
C  1.282686 -1.737175 2.39605
C  0.16546 -2.233447 3.06871
C  2.001386 -0.70627 3.000163
C  -0.239409 -1.705407 4.283711
H  -0.40676 -3.046452 2.632825
C  1.609007 -0.162791 4.21264
H  2.881716 -0.273241 2.537163
C  0.468093 -0.646778 4.856594
H  -1.115023 -2.086411 4.794586
H  2.169937 0.650183 4.655462
O  0.003061 -0.116217 6.000698
H  0.276841 0.817967 6.05603
totalener: -1047.12200677 hartree
nucrepener: 1850.98587527 hartree
electener: -2898.10788205 hartree
oneelecener: -5084.79669439 hartree
twoeener: 2186.68881235 hartree
kineticenergy: 1041.97910309 hartree
exchangeener: -91.593894853374 hartree
correlationener: -6.625527776428 hartree
xcener: -98.219422629802 hartree
temp: 298.15 k
press: 1.00 atm
thermalcorrenthalpy: 0.00094421 hartree
totalenthalpy: -1046.87101506 hartree
totalentropycorr: -0.06166907 hartree
gibbsenthalpy: -1046.93268413 hartree
gibbsminuselec: 0.27939777 hartree
chargesum: 1.0000000
charge: -0.188027 0.173074 -0.156543 0.334481 0.173778 0.129204 -0.344814 0.298621 -0.085855 -0.385183 -0.212218 0.150299 0.140523 0.202068 0.239194 0.010960 -0.346579 0.168744 -0.230951 0.242112 -0.054983 0.240436 0.232735 0.230477 -0.265808 0.135022 0.122700 0.026041 -0.153167 -0.097579 -0.123163 0.128992 -0.193551 0.084364 0.121772 0.149829 0.150497 -0.293466 0.245963
charge: 0.338527 -0.026650 -0.031116 -0.435603 0.038896 0.032547 0.135260 -0.380396 -0.010572 0.114381 0.352223 0.045507 0.041864 -0.010987 -0.370904 -0.030203 0.141537 0.042120 0.397244 -0.128539 0.610544 0.047877 0.003647 0.043456 -0.005218 0.038266 0.043353 -0.122215 -0.013279 -0.027060 0.003095 0.027259 0.000761 0.011488 -0.215106 0.033436 0.031727 0.365604 -0.132770
qa: -0.1880 0.1731 -0.1565 0.3345 0.1738 0.1292 -0.3448 0.2986 -0.0859 -0.3852 -0.2122 0.1503 0.1405 0.2021 0.2392 0.0110 -0.3466 0.1687 -0.2310 0.2421 -0.0550 0.2404 0.2327 0.2305 -0.2658 0.1350 0.1227 0.0260 -0.1532 -0.0976 -0.1232 0.1290 -0.1936 0.0844 0.1218 0.1498 0.1505 -0.2935 0.2460
va: 3.1552 1.0393 3.8636 4.2365 0.9968 1.0181 2.1307 4.1677 3.8256 2.1403 3.2332 1.0234 0.9958 0.9980 4.2549 3.7844 2.1724 0.9904 2.2685 1.0548 3.6235 0.9702 1.0449 0.9784 3.8197 0.9972 1.0042 3.4753 3.9909 3.8821 3.9543 1.0032 3.9927 1.0226 4.0580 1.0091 1.0111 2.2086 1.0473
dispcorr: -0.090364812 hartree
energy: -1047.218756509207
dipole: 3.54790 -1.34340 2.20449 -11.29861 7.27573 -4.02288 -8.87938 4.36193 -4.51745
magnitude: 6.43822 au
magnitude: 16.36466 debye
zeropoint: 0.32534690 hartree
thermalvibcorrection: 0.01659597 hartree
thermalrotcorrection: 0.00141627 hartree
thermaltrasncorrection: 0.00141627 hartree
thermaltotal: -1046.87398110 hartree
thermalcorr: 0.01942851 hartree
nonthermalcorr: 0.32534690 hartree
totalcorr: 0.34477541 hartree
totalenthalpy: -1046.87303689 hartree
