program: Orca
programVersion: 5.0.2
elementType: N H C C H H O C C O N H H H C C O H O H N H H H C H H C C C C H C H C H H O H
charge: 1
multiplicity: 1
keywords: wB97X-D3BJ Opt Freq def2-TZVPP def2/J RIJCOSX VeryTightSCF
keywords: PAL8 defgrid3 VeryTightOpt
frequency: 0.00 0.00 0.00 0.00 0.00 0.00 19.16 46.53 48.84 61.99 82.75 87.17 93.68 100.91 119.39 126.75 171.71 182.46 243.68 249.42 278.35 298.00 318.48 320.71 350.25 353.09 386.97 400.64 425.55 427.30 442.58 482.73 500.67 533.82 554.90 566.45 574.83 618.33 651.93 659.27 685.91 714.11 741.72 745.21 767.69 788.94 801.88 844.11 865.58 877.53 885.18 891.72 932.11 958.13 968.76 985.37 1010.94 1018.74 1044.92 1047.91 1066.71 1097.53 1110.54 1138.22 1140.93 1162.87 1206.96 1212.02 1226.75 1233.36 1247.76 1252.16 1279.05 1293.87 1306.25 1314.80 1332.38 1353.01 1355.41 1368.13 1378.51 1392.40 1418.18 1433.38 1457.26 1467.86 1498.11 1501.22 1503.46 1565.42 1580.03 1618.08 1640.34 1665.81 1684.50 1703.38 1770.30 1801.45 1824.21 2840.72 3053.75 3101.58 3110.41 3124.72 3146.99 3169.54 3179.04 3181.99 3205.58 3218.82 3236.10 3513.27 3580.03 3598.03 3639.36 3670.33 3872.91
frequency: 19.16 46.53 48.84 61.99 82.75 87.17 93.68 100.91 119.39 126.75 171.71 182.46 243.68 249.42 278.35 298.00 318.48 320.71 350.25 353.09 386.97 400.64 425.55 427.30 442.58 482.73 500.67 533.82 554.90 566.45 574.83 618.33 651.93 659.27 685.91 714.11 741.72 745.21 767.69 788.94 801.88 844.11 865.58 877.53 885.18 891.72 932.11 958.13 968.76 985.37 1010.94 1018.74 1044.92 1047.91 1066.71 1097.53 1110.54 1138.22 1140.93 1162.87 1206.96 1212.02 1226.75 1233.36 1247.76 1252.16 1279.05 1293.87 1306.25 1314.80 1332.38 1353.01 1355.41 1368.13 1378.51 1392.40 1418.18 1433.38 1457.26 1467.86 1498.11 1501.22 1503.46 1565.42 1580.03 1618.08 1640.34 1665.81 1684.50 1703.38 1770.30 1801.45 1824.21 2840.72 3053.75 3101.58 3110.41 3124.72 3146.99 3169.54 3179.04 3181.99 3205.58 3218.82 3236.10 3513.27 3580.03 3598.03 3639.36 3670.33 3872.91
formula: C13H18N3O5
InChI: InChI=1S/C13H18N3O5/c14-10(5-8-1-3-9(17)4-2-8)13(21)16-6-11(18)15-7-12(19)20/h1-4,10,15-17,19H,5-7H2,14H3
39 atoms
N  -3.285674 1.100245 -0.05445
H  -3.329208 1.071333 -1.059032
C  -4.366999 0.447259 0.649715
C  -4.096369 -1.053751 0.70227
H  -4.450323 0.831513 1.664182
H  -5.313002 0.628516 0.139044
O  -3.25937 -1.601019 0.024613
C  -2.051094 0.986111 0.504646
C  -0.861571 1.106256 -0.444515
O  -1.872228 0.748308 1.681295
N  -0.026982 -0.071928 -0.234346
H  -0.277977 1.990827 -0.194017
H  -1.164953 1.168857 -1.490815
H  -0.49328 -0.945397 -0.027438
C  1.285215 0.011565 -0.085718
C  2.060817 -1.287289 0.239687
O  1.95083 1.042728 -0.202653
H  1.871423 -2.042615 -0.521932
O  -4.875672 -1.674951 1.579706
H  -4.597931 -2.607413 1.639112
N  3.492538 -0.83887 0.124697
H  4.029259 -1.035265 0.966595
H  3.977615 -1.234344 -0.67655
H  3.363568 0.209669 -0.009504
C  1.796193 -1.853766 1.641184
H  1.914653 -1.052847 2.376078
H  2.564845 -2.607084 1.845214
C  0.427386 -2.477707 1.775552
C  0.10187 -3.633011 1.066609
C  -0.530087 -1.91563 2.615536
C  -1.157905 -4.200904 1.170201
H  0.837504 -4.109877 0.425453
C  -1.786596 -2.482053 2.740973
H  -0.307478 -1.008742 3.164189
C  -2.103692 -3.613465 2.002729
H  -1.405323 -5.089368 0.59955
H  -2.534044 -2.033405 3.382431
O  -3.382218 -4.09206 2.10436
H  -3.472373 -4.908877 1.606138
totalener: -1047.14046718 hartree
nucrepener: 1830.22804498 hartree
electener: -2877.36851215 hartree
oneelecener: -5045.35425570 hartree
twoeener: 2167.98574355 hartree
kineticenergy: 1042.89906125 hartree
exchangeener: -91.750558043770 hartree
correlationener: -6.629403202035 hartree
xcener: -98.379961245805 hartree
temp: 298.15 k
press: 1.00 atm
thermalcorrenthalpy: 0.00094421 hartree
totalenthalpy: -1046.88212001 hartree
totalentropycorr: -0.06680562 hartree
gibbsenthalpy: -1046.94892563 hartree
gibbsminuselec: 0.27847019 hartree
chargesum: 1.0000000
charge: -0.168197 0.170529 -0.064783 0.316305 0.136257 0.135380 -0.365945 0.221697 -0.072810 -0.357846 -0.140942 0.138905 0.113403 0.209087 0.241978 -0.029807 -0.371317 0.159430 -0.273074 0.249380 -0.059349 0.226698 0.232071 0.231617 -0.157208 0.135558 0.130591 -0.077529 -0.179775 -0.125176 -0.116358 0.118849 -0.106827 0.125203 0.220259 0.108810 0.143181 -0.323109 0.224864
charge: 0.321857 -0.022798 -0.038184 -0.443093 0.040339 0.036439 0.093377 -0.391961 -0.007849 0.108545 0.370798 0.039822 0.023334 0.002486 -0.359234 -0.031050 0.122674 0.036235 0.381416 -0.112450 0.605812 0.041694 0.042574 -0.013135 -0.005447 0.042312 0.034744 -0.111857 -0.009987 0.011734 -0.009255 0.022437 0.008259 0.031352 -0.187008 0.022323 0.032594 0.372866 -0.102713
qa: -0.1682 0.1705 -0.0648 0.3163 0.1363 0.1354 -0.3659 0.2217 -0.0728 -0.3578 -0.1409 0.1389 0.1134 0.2091 0.2420 -0.0298 -0.3713 0.1594 -0.2731 0.2494 -0.0593 0.2267 0.2321 0.2316 -0.1572 0.1356 0.1306 -0.0775 -0.1798 -0.1252 -0.1164 0.1188 -0.1068 0.1252 0.2203 0.1088 0.1432 -0.3231 0.2249
va: 3.1884 1.0197 3.8510 4.2725 1.0187 1.0027 2.1251 4.2742 3.8489 2.1564 3.3112 1.0200 1.0062 1.0030 4.2596 3.8660 2.1609 0.9991 2.2202 1.0429 3.5931 0.9812 0.9770 1.0574 3.8234 1.0064 0.9966 3.6663 4.0596 4.0217 4.0345 1.0061 3.9633 1.0244 3.9408 1.0106 1.0134 2.1628 1.0215
dispcorr: -0.086921131 hartree
energy: -1047.227396100786
dipole: 10.20212 -6.06147 4.14065 -1.43106 0.56329 -0.86776 -2.40603 0.53454 -1.87149
magnitude: 4.62607 au
magnitude: 11.75852 debye
zeropoint: 0.32441459 hartree
thermalvibcorrection: 0.01708497 hartree
thermalrotcorrection: 0.00141627 hartree
thermaltrasncorrection: 0.00141627 hartree
thermaltotal: -1046.88306399 hartree
thermalcorr: 0.01991752 hartree
nonthermalcorr: 0.32441459 hartree
totalcorr: 0.34433211 hartree
totalenthalpy: -1046.88211978 hartree
