program: Orca
programVersion: 5.0.2
elementType: N H C C H H O C C O N H H H C C O H O H N H H H C H H C C C C H C H C H H O H
charge: 1
multiplicity: 1
keywords: wB97X-D3BJ Opt Freq def2-TZVPP def2/J RIJCOSX VeryTightSCF
keywords: PAL8 defgrid3 VeryTightOpt
frequency: 0.00 0.00 0.00 0.00 0.00 0.00 9.79 21.19 30.60 36.16 49.49 59.67 70.57 92.34 100.40 138.23 159.91 207.55 212.64 248.27 274.84 281.34 304.52 318.44 342.27 371.79 388.66 405.47 427.25 428.26 438.24 459.04 482.78 515.72 537.22 566.21 596.62 602.44 610.09 658.66 664.32 705.52 742.33 748.39 767.32 787.42 801.77 849.55 857.55 873.53 880.83 883.11 923.77 961.41 967.01 991.49 1011.43 1035.65 1039.95 1043.35 1054.95 1077.36 1102.84 1133.63 1142.76 1164.98 1196.00 1209.07 1229.86 1242.49 1249.94 1290.27 1293.52 1313.61 1318.16 1329.33 1336.38 1361.85 1368.69 1380.18 1383.20 1399.55 1403.55 1421.84 1443.34 1476.87 1483.06 1497.05 1502.61 1582.36 1592.71 1611.99 1642.41 1666.50 1673.15 1702.44 1743.58 1777.95 1892.01 2910.54 3056.66 3102.59 3107.77 3114.16 3142.66 3168.66 3183.20 3192.92 3193.31 3208.60 3232.75 3510.74 3576.58 3629.28 3632.91 3674.45 3876.02
frequency: 9.79 21.19 30.60 36.16 49.49 59.67 70.57 92.34 100.40 138.23 159.91 207.55 212.64 248.27 274.84 281.34 304.52 318.44 342.27 371.79 388.66 405.47 427.25 428.26 438.24 459.04 482.78 515.72 537.22 566.21 596.62 602.44 610.09 658.66 664.32 705.52 742.33 748.39 767.32 787.42 801.77 849.55 857.55 873.53 880.83 883.11 923.77 961.41 967.01 991.49 1011.43 1035.65 1039.95 1043.35 1054.95 1077.36 1102.84 1133.63 1142.76 1164.98 1196.00 1209.07 1229.86 1242.49 1249.94 1290.27 1293.52 1313.61 1318.16 1329.33 1336.38 1361.85 1368.69 1380.18 1383.20 1399.55 1403.55 1421.84 1443.34 1476.87 1483.06 1497.05 1502.61 1582.36 1592.71 1611.99 1642.41 1666.50 1673.15 1702.44 1743.58 1777.95 1892.01 2910.54 3056.66 3102.59 3107.77 3114.16 3142.66 3168.66 3183.20 3192.92 3193.31 3208.60 3232.75 3510.74 3576.58 3629.28 3632.91 3674.45 3876.02
formula: C13H18N3O5
InChI: InChI=1S/C13H18N3O5/c14-10(5-8-1-3-9(17)4-2-8)13(21)16-6-11(18)15-7-12(19)20/h1-4,10,15-17,19H,5-7H2,14H3
39 atoms
N  -0.474933 3.148802 -1.561329
H  -1.032717 3.621913 -0.870877
C  -0.303036 3.789717 -2.862702
C  -1.209405 3.188941 -3.944781
H  -0.55284 4.842507 -2.766431
H  0.742107 3.694905 -3.16498
O  -2.049501 3.827776 -4.505742
C  0.053925 1.952304 -1.274067
C  -0.153399 1.455249 0.162749
O  0.673941 1.275142 -2.087825
N  0.310182 0.090899 0.27527
H  -1.207719 1.49908 0.435725
H  0.408398 2.089445 0.848645
H  -0.317009 -0.65305 0.010013
C  1.618348 -0.16046 0.258077
C  2.069688 -1.592181 -0.098561
O  2.492819 0.671119 0.486584
H  1.766254 -1.793535 -1.125802
O  -0.989325 1.894631 -4.217383
H  -0.261942 1.554093 -3.668552
N  3.569921 -1.47908 -0.074965
H  3.995805 -2.093424 0.615972
H  3.99905 -1.653147 -0.980411
H  3.701312 -0.464246 0.200704
C  1.585816 -2.704396 0.837592
H  1.883028 -2.465439 1.862686
H  2.096319 -3.630287 0.552608
C  0.089002 -2.896293 0.768509
C  -0.524188 -3.291635 -0.423119
C  -0.712582 -2.66056 1.879636
C  -1.897075 -3.433933 -0.509196
H  0.075446 -3.505519 -1.302957
C  -2.091124 -2.808052 1.812352
H  -0.260814 -2.355181 2.817296
C  -2.689219 -3.194094 0.615042
H  -2.373683 -3.745166 -1.430024
H  -2.69963 -2.62812 2.692155
O  -4.023664 -3.354833 0.47421
H  -4.474733 -3.212368 1.310466
totalener: -1047.12787612 hartree
nucrepener: 1692.33336131 hartree
electener: -2739.46123743 hartree
oneelecener: -4768.49469442 hartree
twoeener: 2029.03345699 hartree
kineticenergy: 1042.91015771 hartree
exchangeener: -91.752137931499 hartree
correlationener: -6.624005452626 hartree
xcener: -98.376143384125 hartree
temp: 298.15 k
press: 1.00 atm
thermalcorrenthalpy: 0.00094421 hartree
totalenthalpy: -1046.86529173 hartree
totalentropycorr: -0.06533689 hartree
gibbsenthalpy: -1046.93062862 hartree
gibbsminuselec: 0.27823596 hartree
totalenthalpy: -1046.86827546 hartree
chargesum: 1.0000000
charge: -0.206984 0.191013 -0.110585 0.264065 0.133881 0.141598 -0.267904 0.324095 -0.130890 -0.442943 -0.169900 0.145983 0.158324 0.201019 0.274147 -0.041190 -0.363138 0.166603 -0.247037 0.224533 -0.052356 0.227910 0.237043 0.230768 -0.160100 0.120142 0.141529 -0.051206 -0.169794 -0.151186 -0.138022 0.119630 -0.136090 0.126259 0.193574 0.147722 0.117392 -0.266149 0.218246
charge: 0.338977 -0.010920 -0.028792 -0.453560 0.036600 0.032279 0.143458 -0.376734 -0.023457 0.083093 0.360293 0.034762 0.040747 -0.005342 -0.355972 -0.031569 0.132076 0.041978 0.367223 -0.146256 0.610012 0.044288 0.046228 -0.005032 -0.006233 0.039036 0.036838 -0.116539 -0.011611 -0.002564 0.009694 0.025278 -0.013548 0.027254 -0.191379 0.033394 0.023209 0.373725 -0.100935
qa: -0.2070 0.1910 -0.1106 0.2641 0.1339 0.1416 -0.2679 0.3241 -0.1309 -0.4429 -0.1699 0.1460 0.1583 0.2010 0.2741 -0.0412 -0.3631 0.1666 -0.2470 0.2245 -0.0524 0.2279 0.2370 0.2308 -0.1601 0.1201 0.1415 -0.0512 -0.1698 -0.1512 -0.1380 0.1196 -0.1361 0.1263 0.1936 0.1477 0.1174 -0.2661 0.2182
va: 3.2237 1.0057 3.8101 4.3507 1.0111 1.0004 2.2298 4.1545 3.8414 2.0634 3.3043 0.9953 1.0011 1.0050 4.2219 3.8781 2.1698 0.9991 2.1967 1.0589 3.6016 0.9800 0.9741 1.0526 3.8484 1.0053 0.9932 3.7020 3.9873 4.0271 3.9914 1.0083 3.9228 1.0086 4.0872 1.0087 1.0068 2.2354 1.0250
dispcorr: -0.081653958 hartree
energy: -1047.213606557466
dipole: 8.49523 -4.66189 3.83334 -6.38541 4.31615 -2.06926 8.39133 -5.02016 3.37116
magnitude: 5.50827 au
magnitude: 14.00091 debye
zeropoint: 0.32392866 hartree
thermalvibcorrection: 0.01759920 hartree
thermalrotcorrection: 0.00141627 hartree
thermaltrasncorrection: 0.00141627 hartree
thermaltotal: -1046.86924615 hartree
thermalcorr: 0.02043174 hartree
nonthermalcorr: 0.32392866 hartree
totalcorr: 0.34436040 hartree
totalenthalpy: -1046.86830194 hartree
