program: Orca
programVersion: 5.0.2
elementType: N H C C H H O C C O N H H H C C O H O H N H H H C H H C C C C H C H C H H O H
charge: 1
multiplicity: 1
keywords: wB97X-D3BJ Opt Freq def2-TZVPP def2/J RIJCOSX VeryTightSCF
keywords: PAL8 defgrid3 VeryTightOpt
frequency: 0.00 0.00 0.00 0.00 0.00 0.00 32.50 47.77 56.29 66.15 79.78 101.18 110.12 135.03 152.14 171.75 181.76 208.33 237.04 245.00 280.80 298.24 319.41 332.25 361.98 366.28 383.80 394.00 427.87 430.59 436.85 455.90 481.95 532.38 538.08 585.74 597.02 614.47 634.25 661.44 677.65 684.15 731.53 761.54 800.54 806.48 817.32 851.33 853.77 864.67 878.82 898.05 908.10 930.09 943.68 983.87 1003.87 1017.86 1038.27 1045.43 1051.07 1084.73 1100.57 1123.41 1149.85 1168.02 1196.75 1210.35 1234.50 1246.19 1255.81 1258.02 1316.11 1323.62 1332.09 1335.56 1340.32 1366.02 1367.87 1374.78 1391.34 1407.56 1414.16 1431.37 1488.14 1493.68 1494.88 1500.80 1530.53 1581.79 1584.87 1593.97 1647.46 1657.64 1674.48 1704.78 1758.54 1770.70 1814.21 3070.65 3109.23 3117.86 3128.24 3134.80 3141.49 3163.75 3173.58 3197.98 3203.45 3203.77 3233.86 3442.04 3555.93 3621.65 3650.95 3668.04 3877.44
frequency: 32.50 47.77 56.29 66.15 79.78 101.18 110.12 135.03 152.14 171.75 181.76 208.33 237.04 245.00 280.80 298.24 319.41 332.25 361.98 366.28 383.80 394.00 427.87 430.59 436.85 455.90 481.95 532.38 538.08 585.74 597.02 614.47 634.25 661.44 677.65 684.15 731.53 761.54 800.54 806.48 817.32 851.33 853.77 864.67 878.82 898.05 908.10 930.09 943.68 983.87 1003.87 1017.86 1038.27 1045.43 1051.07 1084.73 1100.57 1123.41 1149.85 1168.02 1196.75 1210.35 1234.50 1246.19 1255.81 1258.02 1316.11 1323.62 1332.09 1335.56 1340.32 1366.02 1367.87 1374.78 1391.34 1407.56 1414.16 1431.37 1488.14 1493.68 1494.88 1500.80 1530.53 1581.79 1584.87 1593.97 1647.46 1657.64 1674.48 1704.78 1758.54 1770.70 1814.21 3070.65 3109.23 3117.86 3128.24 3134.80 3141.49 3163.75 3173.58 3197.98 3203.45 3203.77 3233.86 3442.04 3555.93 3621.65 3650.95 3668.04 3877.44
formula: C13H18N3O5
InChI: InChI=1S/C13H18N3O5/c14-10(5-8-1-3-9(17)4-2-8)13(21)16-6-11(18)15-7-12(19)20/h1-4,10,15-17,19H,5-7H2,14H3
39 atoms
N  0.486831 2.224098 2.05596
H  1.203505 2.382123 1.363024
C  0.928981 2.062279 3.434675
C  1.296851 0.587797 3.599066
H  1.812245 2.67285 3.601797
H  0.138401 2.364048 4.120158
O  2.392886 0.158709 3.296087
C  -0.630388 1.578569 1.641805
C  -0.683931 1.288495 0.143703
O  -1.462404 1.120252 2.410421
N  0.039085 0.027147 -0.043287
H  -0.210229 2.063024 -0.456597
H  -1.716622 1.154697 -0.16649
H  -0.461781 -0.819873 0.167239
C  1.378676 -0.005604 -0.019294
C  2.091048 -1.369135 0.001786
O  2.094178 0.987753 -0.019242
H  2.618385 -1.425043 -0.953473
O  0.332014 -0.228882 3.981607
H  -0.529421 0.219453 3.906119
N  3.157859 -1.178058 1.044844
H  3.823443 -1.947513 1.056563
H  3.640206 -0.299949 0.829977
H  2.759664 -1.040409 1.998029
C  1.30619 -2.66816 0.201623
H  2.001329 -3.49272 0.016145
H  0.577419 -2.722951 -0.610905
C  0.628157 -2.867833 1.537031
C  -0.750574 -2.741431 1.674892
C  1.359913 -3.266697 2.658998
C  -1.380772 -2.959114 2.891383
H  -1.370934 -2.517526 0.81053
C  0.751081 -3.490912 3.87777
H  2.427677 -3.451171 2.579108
C  -0.62751 -3.326211 4.001938
H  -2.457936 -2.858653 2.969693
H  1.321918 -3.804107 4.742387
O  -1.170258 -3.548889 5.220831
H  -2.126869 -3.46824 5.186033
totalener: -1047.12795570 hartree
nucrepener: 1885.80917753 hartree
electener: -2932.93713323 hartree
oneelecener: -5154.70970757 hartree
twoeener: 2221.77257433 hartree
kineticenergy: 1041.99860888 hartree
exchangeener: -91.592602443586 hartree
correlationener: -6.622542032107 hartree
xcener: -98.215144475694 hartree
temp: 298.15 k
press: 1.00 atm
thermalcorrenthalpy: 0.00094421 hartree
totalenthalpy: -1046.87610526 hartree
totalentropycorr: -0.06168643 hartree
gibbsenthalpy: -1046.93779169 hartree
gibbsminuselec: 0.28016795 hartree
totalenthalpy: -1046.87825515 hartree
chargesum: 1.0000000
charge: -0.171527 0.203286 -0.131672 0.367978 0.141691 0.148398 -0.398691 0.247583 -0.106320 -0.392085 -0.150086 0.154081 0.147784 0.194948 0.171007 0.041725 -0.405215 0.172076 -0.215193 0.248638 -0.075520 0.223670 0.239667 0.243925 -0.253783 0.146974 0.144455 0.071041 -0.179794 -0.203833 -0.148241 0.130167 -0.123000 0.117749 0.201914 0.114070 0.136620 -0.271127 0.216637
charge: 0.335156 -0.025248 -0.027787 -0.419779 0.039453 0.034482 0.108588 -0.383509 -0.006502 0.094845 0.357352 0.035122 0.038298 -0.020064 -0.384667 -0.042307 0.087634 0.049745 0.418328 -0.102909 0.611509 0.043074 0.049446 0.002279 -0.009275 0.042609 0.045919 -0.117548 -0.016403 -0.015003 -0.011098 0.020954 0.015872 0.017338 -0.191499 0.023323 0.032322 0.372352 -0.102401
qa: -0.1715 0.2033 -0.1317 0.3680 0.1417 0.1484 -0.3987 0.2476 -0.1063 -0.3921 -0.1501 0.1541 0.1478 0.1949 0.1710 0.0417 -0.4052 0.1721 -0.2152 0.2486 -0.0755 0.2237 0.2397 0.2439 -0.2538 0.1470 0.1445 0.0710 -0.1798 -0.2038 -0.1482 0.1302 -0.1230 0.1177 0.2019 0.1141 0.1366 -0.2711 0.2166
va: 3.1754 1.0221 3.9246 4.1229 1.0086 1.0021 2.1068 4.1741 3.8476 2.1152 3.2273 1.0076 1.0098 1.0387 4.3021 3.8330 2.0903 0.9977 2.2682 1.0292 3.6225 0.9781 0.9976 1.0542 3.8208 1.0001 1.0076 3.4512 4.0463 4.0408 3.9434 1.0000 4.0587 0.9999 4.0887 1.0082 1.0098 2.2307 1.0257
dispcorr: -0.089844113 hartree
energy: -1047.224384021271
dipole: 3.03321 -1.70507 1.32814 -2.63057 2.46810 -0.16247 -6.08254 4.25160 -1.83095
magnitude: 2.26776 au
magnitude: 5.76419 debye
zeropoint: 0.32561026 hartree
thermalvibcorrection: 0.01674139 hartree
thermalrotcorrection: 0.00141627 hartree
thermaltrasncorrection: 0.00141627 hartree
thermaltotal: -1046.87919982 hartree
thermalcorr: 0.01957393 hartree
nonthermalcorr: 0.32561026 hartree
totalcorr: 0.34518420 hartree
totalenthalpy: -1046.87825562 hartree
