program: Orca
programVersion: 5.0.2
elementType: N H C C H H O C C O N H H H C C O H O H N H H H C H H C C C C H C H C H H O H
charge: 1
multiplicity: 1
keywords: wB97X-D3BJ Opt Freq def2-TZVPP def2/J RIJCOSX VeryTightSCF
keywords: PAL8 defgrid3 VeryTightOpt
frequency: 0.00 0.00 0.00 0.00 0.00 0.00 11.08 15.01 31.81 45.00 56.19 61.84 78.09 84.30 94.45 108.52 148.98 187.57 194.73 249.81 270.39 284.25 301.26 348.80 364.29 389.97 399.68 417.43 429.24 432.54 438.99 480.28 515.47 525.82 528.56 578.93 596.01 611.16 617.26 632.99 649.52 661.91 675.66 709.32 745.02 748.63 815.21 845.69 856.88 869.90 874.87 884.63 919.87 940.34 978.94 990.05 998.05 1014.23 1016.04 1042.33 1058.37 1117.49 1134.01 1141.56 1147.62 1162.54 1192.87 1199.44 1207.55 1224.38 1248.70 1262.59 1275.32 1279.77 1320.77 1327.50 1335.13 1344.21 1360.72 1370.40 1379.68 1390.91 1396.46 1449.57 1458.55 1481.68 1494.78 1498.37 1502.72 1513.15 1580.92 1589.76 1609.73 1669.90 1675.83 1700.66 1775.21 1797.24 1899.40 3031.67 3086.54 3094.38 3108.95 3127.94 3128.65 3140.91 3159.02 3178.11 3201.49 3205.52 3232.80 3368.51 3568.47 3571.39 3643.43 3821.78 3875.38
frequency: 11.08 15.01 31.81 45.00 56.19 61.84 78.09 84.30 94.45 108.52 148.98 187.57 194.73 249.81 270.39 284.25 301.26 348.80 364.29 389.97 399.68 417.43 429.24 432.54 438.99 480.28 515.47 525.82 528.56 578.93 596.01 611.16 617.26 632.99 649.52 661.91 675.66 709.32 745.02 748.63 815.21 845.69 856.88 869.90 874.87 884.63 919.87 940.34 978.94 990.05 998.05 1014.23 1016.04 1042.33 1058.37 1117.49 1134.01 1141.56 1147.62 1162.54 1192.87 1199.44 1207.55 1224.38 1248.70 1262.59 1275.32 1279.77 1320.77 1327.50 1335.13 1344.21 1360.72 1370.40 1379.68 1390.91 1396.46 1449.57 1458.55 1481.68 1494.78 1498.37 1502.72 1513.15 1580.92 1589.76 1609.73 1669.90 1675.83 1700.66 1775.21 1797.24 1899.40 3031.67 3086.54 3094.38 3108.95 3127.94 3128.65 3140.91 3159.02 3178.11 3201.49 3205.52 3232.80 3368.51 3568.47 3571.39 3643.43 3821.78 3875.38
formula: C13H18N3O5
InChI: InChI=1S/C13H18N3O5/c14-10(5-8-1-3-9(17)4-2-8)13(21)16-6-11(18)15-7-12(19)20/h1-4,10,15-17,19H,5-7H2,14H3
39 atoms
N  -3.437073 1.697596 0.518944
H  -4.369832 1.350238 0.681049
C  -3.181461 3.123028 0.632979
C  -2.612515 3.768038 -0.63453
H  -4.127225 3.620252 0.852293
H  -2.499331 3.361594 1.449242
O  -1.916663 4.736386 -0.589325
C  -2.479823 0.735099 0.480569
C  -1.030116 1.207516 0.395981
O  -2.73973 -0.45358 0.495851
N  -0.216191 0.014271 0.312186
H  -0.764551 1.795782 1.278119
H  -0.873314 1.845884 -0.476672
H  -0.747834 -0.84753 0.280532
C  1.109162 0.05423 0.299528
C  1.849361 -1.293999 0.166518
O  1.778954 1.081186 0.357139
H  1.675428 -1.679395 -0.839024
O  -2.944735 3.181165 -1.798472
H  -3.512945 2.418688 -1.637814
N  3.29034 -0.897058 0.270284
H  3.874724 -1.260424 -0.476845
H  3.245253 0.152975 0.249902
H  3.660629 -1.187855 1.183332
C  1.498859 -2.351315 1.228054
H  1.895653 -3.314928 0.902468
H  0.413613 -2.459803 1.260459
C  2.057702 -1.991858 2.583021
C  1.471109 -0.995719 3.370369
C  3.214931 -2.60823 3.054067
C  2.022872 -0.624961 4.5802
H  0.557117 -0.514474 3.039774
C  3.782971 -2.244694 4.270165
H  3.670943 -3.411576 2.482059
C  3.18765 -1.247712 5.036452
H  1.565096 0.138258 5.196617
H  4.67587 -2.747742 4.625268
O  3.675522 -0.838953 6.22772
H  4.454245 -1.346349 6.471308
totalener: -1047.12493020 hartree
nucrepener: 1696.28800956 hartree
electener: -2743.41293976 hartree
oneelecener: -4776.12500380 hartree
twoeener: 2032.71206404 hartree
kineticenergy: 1041.96043128 hartree
exchangeener: -91.582103841934 hartree
correlationener: -6.614267005780 hartree
xcener: -98.196370847715 hartree
temp: 298.15 k
press: 1.00 atm
thermalcorrenthalpy: 0.00094421 hartree
totalenthalpy: -1046.86656867 hartree
totalentropycorr: -0.06413915 hartree
gibbsenthalpy: -1046.93070782 hartree
gibbsminuselec: 0.27657385 hartree
totalenthalpy: -1046.86850716 hartree
totalenthalpy: -1046.86883894 hartree
chargesum: 1.0000000
charge: -0.244842 0.213967 -0.102936 0.240082 0.142897 0.130552 -0.254503 0.239689 -0.099368 -0.350450 -0.165761 0.137843 0.166906 0.186852 0.218461 -0.016911 -0.362803 0.159571 -0.222443 0.216572 -0.052814 0.230616 0.229323 0.227433 -0.201007 0.138255 0.135375 0.032364 -0.137949 -0.267838 -0.114694 0.107671 -0.121627 0.157978 0.186538 0.142600 0.121495 -0.265786 0.218690
charge: 0.319381 -0.009171 -0.049207 -0.461434 0.043503 0.033622 0.154351 -0.377219 -0.019163 0.096659 0.354237 0.037137 0.040795 -0.025050 -0.379061 -0.030370 0.121122 0.040165 0.378570 -0.112068 0.614535 0.039613 0.004667 0.038874 0.000642 0.039719 0.041074 -0.116935 0.003135 -0.021451 0.018540 0.025449 -0.013370 0.025127 -0.188021 0.032980 0.023401 0.375259 -0.100037
qa: -0.2448 0.2140 -0.1029 0.2401 0.1429 0.1306 -0.2545 0.2397 -0.0994 -0.3504 -0.1658 0.1378 0.1669 0.1869 0.2185 -0.0169 -0.3628 0.1596 -0.2224 0.2166 -0.0528 0.2306 0.2293 0.2274 -0.2010 0.1383 0.1354 0.0324 -0.1379 -0.2678 -0.1147 0.1077 -0.1216 0.1580 0.1865 0.1426 0.1215 -0.2658 0.2187
va: 3.1154 0.9955 3.8189 4.3402 0.9898 1.0130 2.2557 4.2611 3.8187 2.1634 3.2289 1.0004 1.0116 1.0490 4.2264 3.9270 2.1612 0.9948 2.2053 1.0320 3.5857 0.9769 1.0440 1.0128 3.8599 1.0053 1.0092 3.5470 4.0551 4.0092 3.9832 1.0201 3.9513 1.0004 4.1104 1.0084 1.0054 2.2378 1.0247
dispcorr: -0.082221983 hartree
energy: -1047.213524652696
dipole: 5.99400 -3.85839 2.13561 -8.12094 5.22302 -2.89792 0.71586 -1.09372 -0.37785
magnitude: 3.61960 au
magnitude: 9.20030 debye
zeropoint: 0.32324511 hartree
thermalvibcorrection: 0.01766287 hartree
thermalrotcorrection: 0.00141627 hartree
thermaltrasncorrection: 0.00141627 hartree
thermaltotal: -1046.86978414 hartree
thermalcorr: 0.02049541 hartree
nonthermalcorr: 0.32324511 hartree
totalcorr: 0.34374052 hartree
totalenthalpy: -1046.86883993 hartree
