program: Orca
programVersion: 5.0.2
elementType: N H C C H H O C C O N H H H C C O H O H N H H H C H H C C C C H C H C H H O H
charge: 1
multiplicity: 1
keywords: wB97X-D3BJ Opt Freq def2-TZVPP def2/J RIJCOSX VeryTightSCF
keywords: PAL8 defgrid3 VeryTightOpt
frequency: 0.00 0.00 0.00 0.00 0.00 0.00 22.39 28.73 37.31 39.75 47.23 64.64 70.52 79.14 104.18 153.94 169.37 195.78 199.61 259.62 271.36 293.99 306.30 326.35 362.70 371.93 380.06 384.25 413.24 428.86 434.12 460.10 482.64 516.17 523.35 566.49 589.02 607.78 628.72 643.11 658.87 699.86 712.31 739.11 752.06 774.54 823.67 851.34 859.20 869.77 878.13 887.52 890.21 924.44 968.32 982.88 989.21 1009.82 1041.55 1045.93 1069.70 1093.92 1107.71 1141.99 1156.25 1183.72 1196.94 1198.60 1207.13 1245.69 1251.80 1263.25 1287.20 1290.60 1332.35 1333.85 1336.42 1344.79 1364.94 1370.80 1396.41 1422.13 1439.47 1447.96 1477.82 1491.20 1495.69 1500.54 1505.08 1534.28 1580.37 1601.24 1607.21 1671.84 1676.86 1700.62 1776.33 1801.11 1812.89 3085.18 3111.13 3131.35 3141.90 3144.99 3159.24 3180.55 3185.27 3204.87 3208.47 3231.50 3340.79 3411.71 3472.44 3633.49 3643.55 3811.74 3876.67
frequency: 22.39 28.73 37.31 39.75 47.23 64.64 70.52 79.14 104.18 153.94 169.37 195.78 199.61 259.62 271.36 293.99 306.30 326.35 362.70 371.93 380.06 384.25 413.24 428.86 434.12 460.10 482.64 516.17 523.35 566.49 589.02 607.78 628.72 643.11 658.87 699.86 712.31 739.11 752.06 774.54 823.67 851.34 859.20 869.77 878.13 887.52 890.21 924.44 968.32 982.88 989.21 1009.82 1041.55 1045.93 1069.70 1093.92 1107.71 1141.99 1156.25 1183.72 1196.94 1198.60 1207.13 1245.69 1251.80 1263.25 1287.20 1290.60 1332.35 1333.85 1336.42 1344.79 1364.94 1370.80 1396.41 1422.13 1439.47 1447.96 1477.82 1491.20 1495.69 1500.54 1505.08 1534.28 1580.37 1601.24 1607.21 1671.84 1676.86 1700.62 1776.33 1801.11 1812.89 3085.18 3111.13 3131.35 3141.90 3144.99 3159.24 3180.55 3185.27 3204.87 3208.47 3231.50 3340.79 3411.71 3472.44 3633.49 3643.55 3811.74 3876.67
formula: C13H18N3O5
InChI: InChI=1S/C13H18N3O5/c14-10(5-8-1-3-9(17)4-2-8)13(21)16-6-11(18)15-7-12(19)20/h1-4,10,15-17,19H,5-7H2,14H3
39 atoms
N  -0.580044 1.372133 -2.833546
H  -0.980834 1.085977 -3.714312
C  0.64689 2.115188 -2.877656
C  1.882425 1.270024 -3.155328
H  0.59084 2.894665 -3.638365
H  0.841522 2.61984 -1.930217
O  2.001704 0.086428 -2.919327
C  -1.264333 0.884961 -1.759781
C  -0.736162 1.14226 -0.347189
O  -2.244662 0.184319 -1.898368
N  0.06148 -0.028473 0.002198
H  -1.598942 1.214856 0.311283
H  -0.114271 2.024117 -0.227467
H  -0.406051 -0.917709 -0.084141
C  1.398147 0.002608 -0.008944
C  2.103604 -1.355366 0.004288
O  2.084273 1.015402 -0.031121
H  1.538483 -2.112866 -0.538508
O  2.851798 2.016426 -3.674687
H  3.629353 1.469071 -3.845525
N  3.361656 -1.111844 -0.766257
H  4.022718 -1.879153 -0.622379
H  3.139701 -0.959247 -1.759355
H  3.745076 -0.225329 -0.41746
C  2.454161 -1.835264 1.418612
H  1.518991 -2.077251 1.926972
H  2.91341 -1.00879 1.967067
C  3.381659 -3.025252 1.372546
C  2.905152 -4.292891 1.042416
C  4.750547 -2.871659 1.600319
C  3.76348 -5.375817 0.939893
H  1.843239 -4.447693 0.87778
C  5.622411 -3.94422 1.497998
H  5.142887 -1.901721 1.892768
C  5.129466 -5.204255 1.166026
H  3.372509 -6.357596 0.694724
H  6.681619 -3.828308 1.689647
O  6.021597 -6.216683 1.083475
H  5.578383 -7.046426 0.888344
totalener: -1047.13709608 hartree
nucrepener: 1702.80804052 hartree
electener: -2749.94513660 hartree
oneelecener: -4789.20836349 hartree
twoeener: 2039.26322690 hartree
kineticenergy: 1041.99396935 hartree
exchangeener: -91.591667293312 hartree
correlationener: -6.613492499027 hartree
xcener: -98.205159792339 hartree
temp: 298.15 k
press: 1.00 atm
thermalcorrenthalpy: 0.00094421 hartree
totalenthalpy: -1046.87718763 hartree
totalentropycorr: -0.06402318 hartree
gibbsenthalpy: -1046.94121080 hartree
gibbsminuselec: 0.27836431 hartree
totalenthalpy: -1046.87940073 hartree
chargesum: 1.0000000
charge: -0.177833 0.191070 -0.075562 0.336867 0.169519 0.128522 -0.408109 0.199832 -0.110006 -0.323713 -0.160479 0.160848 0.132269 0.190225 0.216525 0.026908 -0.399257 0.155219 -0.221891 0.231764 -0.083747 0.239338 0.244580 0.225826 -0.182823 0.134293 0.139271 0.004676 -0.175915 -0.231350 -0.137202 0.132715 -0.128235 0.146374 0.195902 0.117136 0.146641 -0.268548 0.218350
charge: 0.330004 -0.004904 -0.049361 -0.412242 0.042543 0.041376 0.091925 -0.393371 -0.011125 0.101516 0.353611 0.038730 0.022476 -0.004381 -0.396947 -0.046845 0.082365 0.038171 0.401381 -0.081511 0.616611 0.040637 0.016251 0.042966 0.004145 0.044226 0.043264 -0.117913 -0.002820 -0.019311 -0.006940 0.027027 0.006753 0.024844 -0.189983 0.023789 0.031960 0.372350 -0.101263
qa: -0.1778 0.1911 -0.0756 0.3369 0.1695 0.1285 -0.4081 0.1998 -0.1100 -0.3237 -0.1605 0.1608 0.1323 0.1902 0.2165 0.0269 -0.3993 0.1552 -0.2219 0.2318 -0.0837 0.2393 0.2446 0.2258 -0.1828 0.1343 0.1393 0.0047 -0.1759 -0.2313 -0.1372 0.1327 -0.1282 0.1464 0.1959 0.1171 0.1466 -0.2685 0.2184
va: 3.1117 1.0144 3.7946 4.2366 1.0010 1.0165 2.0795 4.3337 3.8156 2.1935 3.2532 1.0083 1.0147 1.0150 4.2845 3.8171 2.1159 1.0065 2.2812 1.0253 3.6626 0.9865 1.0186 1.0128 3.8278 1.0124 1.0143 3.5267 4.0557 3.9803 3.9474 1.0052 3.9946 1.0015 4.0932 1.0068 1.0072 2.2327 1.0250
dispcorr: -0.083116362 hartree
energy: -1047.225430750545
dipole: 2.52252 -1.20546 1.31706 -0.96700 0.89923 -0.06777 3.21480 -3.85531 -0.64051
magnitude: 1.46611 au
magnitude: 3.72656 debye
zeropoint: 0.32466863 hartree
thermalvibcorrection: 0.01756905 hartree
thermalrotcorrection: 0.00141627 hartree
thermaltrasncorrection: 0.00141627 hartree
thermaltotal: -1046.88036052 hartree
thermalcorr: 0.02040159 hartree
nonthermalcorr: 0.32466863 hartree
totalcorr: 0.34507023 hartree
totalenthalpy: -1046.87941631 hartree
