program: Orca
programVersion: 5.0.2
elementType: N H C C H H O C C O N H H H C C O H O H N H H H C H H C C C C H C H C H H O H
charge: 1
multiplicity: 1
keywords: wB97X-D3BJ Opt Freq def2-TZVPP def2/J RIJCOSX VeryTightSCF
keywords: PAL8 defgrid3 VeryTightOpt
frequency: 0.00 0.00 0.00 0.00 0.00 0.00 21.20 44.30 57.59 60.46 64.92 70.70 93.29 93.78 105.93 120.44 145.05 192.15 205.78 259.46 291.89 296.71 312.07 315.20 335.97 355.51 381.86 410.91 427.17 428.87 438.31 447.51 516.08 531.60 558.26 568.62 584.42 601.57 643.87 658.44 659.23 698.63 704.21 747.16 755.14 762.42 804.27 838.34 851.51 874.11 884.19 895.45 928.92 949.46 982.67 991.31 993.88 1016.27 1019.20 1021.48 1045.91 1097.92 1132.19 1140.56 1153.27 1154.42 1198.58 1212.92 1224.86 1235.07 1254.38 1262.32 1274.20 1289.26 1312.80 1327.46 1339.00 1352.32 1361.87 1370.73 1381.60 1403.06 1418.63 1446.33 1463.65 1490.70 1495.36 1502.48 1504.57 1513.90 1581.20 1597.85 1635.33 1673.84 1681.50 1703.30 1780.94 1794.75 1850.39 3065.58 3077.10 3089.42 3117.59 3121.03 3135.56 3152.26 3177.49 3187.56 3196.86 3206.74 3238.40 3502.29 3554.87 3565.62 3638.09 3726.21 3872.38
frequency: 21.20 44.30 57.59 60.46 64.92 70.70 93.29 93.78 105.93 120.44 145.05 192.15 205.78 259.46 291.89 296.71 312.07 315.20 335.97 355.51 381.86 410.91 427.17 428.87 438.31 447.51 516.08 531.60 558.26 568.62 584.42 601.57 643.87 658.44 659.23 698.63 704.21 747.16 755.14 762.42 804.27 838.34 851.51 874.11 884.19 895.45 928.92 949.46 982.67 991.31 993.88 1016.27 1019.20 1021.48 1045.91 1097.92 1132.19 1140.56 1153.27 1154.42 1198.58 1212.92 1224.86 1235.07 1254.38 1262.32 1274.20 1289.26 1312.80 1327.46 1339.00 1352.32 1361.87 1370.73 1381.60 1403.06 1418.63 1446.33 1463.65 1490.70 1495.36 1502.48 1504.57 1513.90 1581.20 1597.85 1635.33 1673.84 1681.50 1703.30 1780.94 1794.75 1850.39 3065.58 3077.10 3089.42 3117.59 3121.03 3135.56 3152.26 3177.49 3187.56 3196.86 3206.74 3238.40 3502.29 3554.87 3565.62 3638.09 3726.21 3872.38
formula: C13H18N3O5
InChI: InChI=1S/C13H18N3O5/c14-10(5-8-1-3-9(17)4-2-8)13(21)16-6-11(18)15-7-12(19)20/h1-4,10,15-17,19H,5-7H2,14H3
39 atoms
N  -3.292151 1.510468 0.443863
H  -4.211588 1.096733 0.48263
C  -3.073257 2.700995 1.248647
C  -2.688453 2.34272 2.680396
H  -2.290173 3.328947 0.828371
H  -3.995334 3.282326 1.259271
O  -1.725475 2.780999 3.251784
C  -2.317633 0.615864 0.154448
C  -0.874397 1.125329 0.187632
O  -2.547334 -0.53944 -0.156483
N  -0.037244 -0.040646 0.008559
H  -0.635199 1.616728 1.132986
H  -0.722385 1.848804 -0.616949
H  -0.554373 -0.912961 0.002888
C  1.282017 -0.010054 0.014276
C  1.998811 -1.365816 0.116171
O  1.993454 0.993113 -0.016904
H  1.473313 -2.161492 -0.40976
O  -3.530512 1.439866 3.192285
H  -3.182893 1.107434 4.035435
N  3.312851 -1.097524 -0.565686
H  4.088023 -1.605518 -0.144331
H  3.291324 -1.290641 -1.565733
H  3.416077 -0.062657 -0.428102
C  2.274286 -1.727858 1.590642
H  3.083524 -1.083373 1.947362
H  2.62402 -2.762371 1.637101
C  1.067949 -1.517596 2.471912
C  0.915568 -0.308967 3.150288
C  0.061153 -2.47117 2.56919
C  -0.214434 -0.048518 3.904153
H  1.690173 0.448218 3.087069
C  -1.083201 -2.22238 3.315996
H  0.159697 -3.425416 2.061317
C  -1.217919 -1.009165 3.982056
H  -0.331932 0.891206 4.427868
H  -1.863507 -2.972909 3.381363
O  -2.317815 -0.699049 4.731402
H  -2.91655 -1.449637 4.77303
totalener: -1047.12820638 hartree
nucrepener: 1824.30636220 hartree
electener: -2871.43456857 hartree
oneelecener: -5033.13444460 hartree
twoeener: 2161.69987603 hartree
kineticenergy: 1041.97899281 hartree
exchangeener: -91.587442269521 hartree
correlationener: -6.617515341648 hartree
xcener: -98.204957611169 hartree
temp: 298.15 k
press: 1.00 atm
thermalcorrenthalpy: 0.00094421 hartree
totalenthalpy: -1046.87377638 hartree
totalentropycorr: -0.06304963 hartree
gibbsenthalpy: -1046.93682601 hartree
gibbsminuselec: 0.27767636 hartree
totalenthalpy: -1046.87595051 hartree
chargesum: 1.0000000
charge: -0.184608 0.198955 -0.071302 0.270824 0.126287 0.141051 -0.303119 0.244519 -0.104915 -0.360053 -0.120037 0.133661 0.149176 0.185955 0.166132 0.055899 -0.379131 0.160474 -0.278230 0.246408 -0.074623 0.233117 0.233698 0.237358 -0.205996 0.126236 0.139146 -0.000979 -0.117902 -0.213213 -0.193071 0.140543 -0.112046 0.130211 0.238387 0.147916 0.112985 -0.328547 0.228834
charge: 0.327303 -0.005379 -0.041310 -0.454998 0.035460 0.040448 0.120757 -0.376623 -0.016584 0.092037 0.371206 0.033029 0.038690 -0.018667 -0.396560 -0.031786 0.097441 0.034462 0.370360 -0.101764 0.608862 0.045980 0.050675 0.023760 -0.002080 0.039923 0.035856 -0.104698 0.006413 -0.001476 0.005642 0.030306 -0.006414 0.026079 -0.191699 0.031391 0.023829 0.362749 -0.102621
qa: -0.1846 0.1990 -0.0713 0.2708 0.1263 0.1411 -0.3031 0.2445 -0.1049 -0.3601 -0.1200 0.1337 0.1492 0.1860 0.1661 0.0559 -0.3791 0.1605 -0.2782 0.2464 -0.0746 0.2331 0.2337 0.2374 -0.2060 0.1262 0.1391 -0.0010 -0.1179 -0.2132 -0.1931 0.1405 -0.1120 0.1302 0.2384 0.1479 0.1130 -0.3285 0.2288
va: 3.1986 1.0116 3.8514 4.2858 1.0086 0.9961 2.1836 4.2685 3.8321 2.1519 3.2707 1.0203 1.0025 1.0487 4.3280 3.7592 2.1502 0.9945 2.2039 1.0353 3.6345 0.9748 0.9762 1.0340 3.8776 1.0063 1.0041 3.6391 3.9579 4.0763 4.0087 1.0051 3.9922 1.0049 3.9158 1.0263 1.0103 2.1460 1.0171
dispcorr: -0.086568105 hartree
energy: -1047.221264279794
dipole: 9.23397 -5.98159 3.25237 -4.81617 2.58815 -2.22802 -4.50786 2.07709 -2.43077
magnitude: 4.63149 au
magnitude: 11.77230 debye
zeropoint: 0.32418830 hartree
thermalvibcorrection: 0.01734768 hartree
thermalrotcorrection: 0.00141627 hartree
thermaltrasncorrection: 0.00141627 hartree
thermaltotal: -1046.87689576 hartree
thermalcorr: 0.02018022 hartree
nonthermalcorr: 0.32418830 hartree
totalcorr: 0.34436852 hartree
totalenthalpy: -1046.87595155 hartree
