program: Orca
programVersion: 5.0.2
elementType: Si Si Si Si Si Si Si Si Si Si Si Si Si Si Si Si Si Si Si Si Si Si Si Si Si Si O O O O O O O O O O O O O O O O O O O O O O O O O O O O O O O O O O O O O O O O O O O O O O O O O O O O O O O O O O O O O O O O O O O O O O Al Al Cr Ag H H H H H H H H H H H H H H H H H H H H H H H H H H H H
elementType: Ag
charge: 0
multiplicity: 4
keywords: QMMM pbe d3bj def2-svp
formula: H28Al2CrO70Si26Ag
InChI: InChI=1S/Ag.2Al.Cr.H28O70Si26/c;;;;1-71(2,3)37-81(23)53-87(29)43-75(11,12)39-73(7,8)41-83(25)45-77(15,16)47-85(27)59-86(28)48-78(17,18)46-84(26,58-94(36,61-86)63-93(35,57-83)60-85)42-74(9,10)40-76(13,14)44-88(30)54-82(24,38-72(4,5)6)56-90(32)50-80(21,22)52-92(34)62-91(33)51-79(19,20)49-89(31,55-81)66-95(64-87,68-91)70-96(65-88,67-90)69-92/h;;;;1-2,4-5,7,9,11-28,31-34H/q;2*+3;;-6
128 atoms
Si -1.670031 12.999888 3.515343
Si 3.130671 15.792039 6.544533
Si 5.285609 9.162866 -1.629065
Si 5.300749 14.500584 1.582596
Si 1.570093 10.541615 11.599581
Si 3.75103 11.786007 -1.604152
Si -1.519951 10.515242 8.461797
Si 3.126248 15.772867 3.483249
Si -1.592445 13.065282 6.585383
Si 5.288593 14.50319 -1.535783
Si 3.127548 7.884517 11.549331
Si -1.56061 10.513372 11.589336
Si 3.091598 7.919403 8.424097
Si 5.383214 9.177337 1.482668
Si 5.271938 6.64067 6.555524
Si 1.550003 10.524903 8.490585
Si 3.860755 11.823427 1.498601
Si 1.527047 13.062597 6.623414
Si 1.55091 5.25555 8.430979
Si 8.404898 6.617756 6.54052
Si 3.62384 3.846963 3.494666
Si 8.390115 9.135241 -1.538085
Si 1.518638 5.19233 11.560977
Si 3.752826 3.937112 6.581348
Si 8.43473 6.586749 3.452443
Si 8.399093 9.133942 1.601095
O  -2.431417 11.571493 12.414585
O  2.473773 6.456945 11.93174
O  0.006164 10.69106 11.975904
O  4.993674 7.209301 5.06518
O  6.828145 14.815215 2.102011
O  -2.503676 9.333764 7.928209
O  2.595449 17.21127 2.929348
O  4.362969 13.252115 -1.952416
O  4.851345 10.675178 -2.025904
O  6.855803 8.96312 -1.999331
O  4.427926 8.062095 -2.438781
O  4.494339 8.072181 12.397562
O  3.645222 15.978392 5.019262
O  -2.52014 11.912116 2.700862
O  4.394457 15.438388 2.502893
O  1.93823 16.839961 6.920789
O  5.19592 14.948906 0.020536
O  -1.863441 11.819656 7.576667
O  2.402197 11.643363 12.439936
O  -1.973173 14.555599 3.113716
O  6.819401 14.017289 -1.926165
O  -2.053417 12.721203 5.091712
O  4.450216 15.942769 7.446511
O  4.810118 15.784296 -2.379062
O  2.046286 9.034344 11.935467
O  -1.899996 8.950591 11.936283
O  -2.472055 14.294963 7.164645
O  5.06164 8.881319 -0.062428
O  1.903478 6.839896 8.250719
O  6.919477 6.155711 3.308458
O  4.416007 7.594072 7.557463
O  2.46632 14.342254 6.880107
O  6.847181 6.82686 6.917031
O  4.914579 5.081021 6.703071
O  4.489857 10.423345 2.039414
O  1.990358 12.336915 5.175948
O  2.536001 9.370961 7.918781
O  0.027458 10.040119 8.271111
O  4.22313 5.281253 3.157632
O  6.895981 9.691816 1.790659
O  2.018569 14.628768 3.488068
O  3.534277 7.979357 9.975422
O  -0.000944 13.516574 6.620686
O  1.8799 11.907284 7.689645
O  3.378393 11.697602 -0.032424
O  1.823526 10.890064 10.027604
O  -0.097236 12.777461 3.308486
O  4.967348 7.920034 2.34738
O  5.062072 12.904164 1.675247
O  8.781593 6.965483 4.998662
O  1.98395 3.910782 12.401929
O  0.023406 5.009981 7.912654
O  9.492136 5.46164 2.926431
O  8.730622 10.706299 -1.922618
O  9.25636 7.690408 7.393185
O  -0.004306 5.687976 11.916905
O  8.726568 5.055612 6.900092
O  2.221162 3.625128 2.740202
O  3.231662 3.720562 5.082913
O  4.814847 2.798964 3.091762
O  9.291649 8.075858 -2.344664
O  8.676759 8.843869 0.024743
O  1.644221 4.809433 9.983738
O  4.354561 2.538964 7.150427
O  9.413372 10.320729 2.116799
O  2.4981 4.302965 7.549572
O  8.790977 7.890121 2.510848
O  2.623254 12.117112 2.454427
O  2.376031 11.600083 -2.428154
O  -1.840664 10.824355 10.011417
Al 5.258704 6.58107 3.427825
Al 1.560563 12.984165 3.500791
Cr 3.138734 10.89077 5.023684
Ag 4.84706 9.340067 4.271642
H  -3.169206 11.700825 13.041182
H  7.715198 14.623679 1.773572
H  -2.848998 8.484809 8.251985
H  1.991289 17.908213 3.246077
H  3.662668 7.950212 -3.038641
H  4.935317 8.673028 13.033984
H  -3.206723 11.847991 2.026796
H  1.716097 17.74964 6.703325
H  3.156851 11.731215 13.051902
H  -2.624675 15.232452 3.324038
H  7.708788 14.287846 -1.699215
H  4.916659 16.540696 8.048299
H  5.071556 16.472122 -3.013389
H  -2.593732 8.325912 11.716266
H  -2.835627 15.125376 6.80644
H  1.732717 3.204921 13.03583
H  -0.886618 5.108384 8.245407
H  9.73547 4.577683 3.244844
H  9.413464 11.334977 -1.697715
H  9.986535 7.789915 8.02575
H  -0.895623 5.393505 11.708072
H  9.41175 4.409128 6.694574
H  1.835735 3.082568 2.043431
H  5.070843 1.903658 3.314754
H  10.001457 7.956031 -2.998844
H  4.878924 1.792153 6.800428
H  9.702165 11.175073 1.779825
H  1.901221 10.994368 -3.034147
exchangeener: -1214.765923568862 hartree
correlationener: -37.309970635213 hartree
xcener: -1252.075894204075 hartree
s2: 4.699752
chargesum: -0.0000000
charge: 0.799363 0.779471 0.823900 0.797719 0.826467 0.829293 0.813405 0.826332 0.809539 0.774551 0.830136 0.792446 0.888567 0.924560 0.951458 0.870902 0.892727 0.972801 0.813823 0.784228 0.783249 0.770791 0.798426 0.807082 0.817120 0.808989 -0.302378 -0.426204 -0.422445 -0.587558 -0.320926 -0.311093 -0.325192 -0.421232 -0.464618 -0.421349 -0.305998 -0.318531 -0.458621 -0.300514 -0.407495 -0.358482 -0.448523 -0.403662 -0.312228 -0.375855 -0.369666 -0.445349 -0.313355 -0.304527 -0.462152 -0.357204 -0.307248 -0.424266 -0.480356 -0.503590 -0.425061 -0.415827 -0.432300 -0.459228 -0.470430 -0.673516 -0.464898 -0.473445 -0.470365 -0.479135 -0.507207 -0.453671 -0.454691 -0.435488 -0.437686 -0.441960 -0.477465 -0.496442 -0.475570 -0.464775 -0.307373 -0.318339 -0.321661 -0.368900 -0.324279 -0.363815 -0.364321 -0.306306 -0.444633 -0.372490 -0.305630 -0.441741 -0.447587 -0.319024 -0.320752 -0.406860 -0.415439 -0.488475 -0.308567 -0.445753 0.835721 0.823131 0.626831 -0.034348 0.207073 0.124438 0.149682 0.165993 0.182362 0.176995 0.193715 0.162779 0.175490 0.160013 0.115727 0.192830 0.189138 0.136075 0.174438 0.209238 0.145193 0.160806 0.113743 0.187539 0.135666 0.160378 0.187853 0.151213 0.190083 0.172341 0.118550 0.183693
charge: 0.429013 0.434276 0.451947 0.450174 0.456185 0.456299 0.457982 0.450133 0.464848 0.433450 0.462420 0.443635 0.479622 0.461650 0.499772 0.461311 0.466111 0.509710 0.461231 0.431905 0.416883 0.431188 0.446537 0.461497 0.442508 0.448806 -0.154597 -0.239710 -0.236642 -0.206867 -0.189012 -0.174278 -0.184355 -0.235567 -0.253560 -0.235426 -0.166134 -0.176473 -0.262063 -0.152980 -0.229065 -0.187955 -0.256868 -0.226133 -0.170960 -0.195587 -0.206665 -0.252295 -0.163504 -0.161134 -0.253049 -0.190712 -0.168380 -0.221875 -0.259392 -0.264783 -0.237859 -0.233925 -0.240309 -0.243517 -0.194726 -0.199390 -0.249685 -0.254329 -0.248996 -0.236803 -0.268219 -0.247337 -0.239972 -0.235503 -0.232538 -0.240304 -0.256295 -0.190388 -0.252158 -0.261339 -0.159569 -0.182103 -0.182940 -0.206197 -0.174393 -0.197530 -0.194095 -0.159500 -0.250650 -0.193919 -0.161837 -0.251656 -0.253973 -0.178398 -0.187719 -0.229453 -0.231179 -0.232738 -0.168226 -0.252171 0.224637 0.230459 0.570648 -0.183002 0.120931 0.058517 0.079694 0.088874 0.105305 0.101212 0.105100 0.078875 0.098788 0.077380 0.046591 0.106421 0.106872 0.061497 0.095455 0.124342 0.077280 0.082607 0.044443 0.103499 0.061649 0.078405 0.099863 0.069311 0.107871 0.094644 0.054332 0.106267
qa: 0.7994 0.7795 0.8239 0.7977 0.8265 0.8293 0.8134 0.8263 0.8095 0.7746 0.8301 0.7924 0.8886 0.9246 0.9515 0.8709 0.8927 0.9728 0.8138 0.7842 0.7832 0.7708 0.7984 0.8071 0.8171 0.8090 -0.3024 -0.4262 -0.4224 -0.5876 -0.3209 -0.3111 -0.3252 -0.4212 -0.4646 -0.4213 -0.3060 -0.3185 -0.4586 -0.3005 -0.4075 -0.3585 -0.4485 -0.4037 -0.3122 -0.3759 -0.3697 -0.4453 -0.3134 -0.3045 -0.4622 -0.3572 -0.3072 -0.4243 -0.4804 -0.5036 -0.4251 -0.4158 -0.4323 -0.4592 -0.4704 -0.6735 -0.4649 -0.4734 -0.4704 -0.4791 -0.5072 -0.4537 -0.4547 -0.4355 -0.4377 -0.4420 -0.4775 -0.4964 -0.4756 -0.4648 -0.3074 -0.3183 -0.3217 -0.3689 -0.3243 -0.3638 -0.3643 -0.3063 -0.4446 -0.3725 -0.3056 -0.4417 -0.4476 -0.3190 -0.3208 -0.4069 -0.4154 -0.4885 -0.3086 -0.4458 0.8357 0.8231 0.6268 -0.0343 0.2071 0.1244 0.1497 0.1660 0.1824 0.1770 0.1937 0.1628 0.1755 0.1600 0.1157 0.1928 0.1891 0.1361 0.1744 0.2092 0.1452 0.1608 0.1137 0.1875 0.1357 0.1604 0.1879 0.1512 0.1901 0.1723 0.1185 0.1837
va: 4.7817 4.8119 4.7789 4.7970 4.7754 4.7740 4.7792 4.7659 4.7840 4.8124 4.7708 4.7923 4.7116 4.6543 4.6195 4.7372 4.6975 4.5789 4.7791 4.8058 4.7984 4.8165 4.7848 4.7886 4.7860 4.7842 2.2576 2.2742 2.2781 2.1778 2.1767 2.2120 2.2111 2.2781 2.2568 2.2792 2.2415 2.2207 2.2385 2.2580 2.2986 2.1734 2.2450 2.3017 2.2289 2.1485 2.1166 2.2559 2.2358 2.2372 2.2556 2.1533 2.2396 2.3019 2.2457 2.2640 2.2967 2.2931 2.2752 2.2699 2.2615 2.0955 2.2671 2.2532 2.2920 2.2542 2.2615 2.2682 2.2796 2.2882 2.2893 2.2789 2.2866 2.2612 2.2490 2.2318 2.2513 2.1961 2.2142 2.1166 2.2167 2.1443 2.1642 2.2461 2.2542 2.1445 2.2370 2.2532 2.2484 2.2215 2.1738 2.2978 2.2942 2.2832 2.2389 2.2513 3.6180 3.6304 6.0098 2.3186 0.9911 1.0329 1.0221 1.0142 1.0051 1.0077 0.9993 1.0178 1.0088 1.0191 1.0409 0.9996 1.0008 1.0326 1.0108 0.9894 1.0237 1.0172 1.0418 1.0016 1.0323 1.0184 1.0022 1.0232 1.0002 1.0111 1.0353 1.0045
dispcorr: -0.259614589 hartree
dipole: -89.90672 86.18702 -3.71970 29.13574 -29.08940 0.04634 49.98429 -47.13540 2.84889
magnitude: 4.68557 au
magnitude: 11.90976 debye
