program: Orca
programVersion: 5.0.2
elementType: Si Si Si Si Si Si Si Si Si Si Si Si Si Si Si Si Si Si Si Si Si Si Si Si Si Si O O O O O O O O O O O O O O O O O O O O O O O O O O O O O O O O O O O O O O O O O O O O O O O O O O O O O O O O O O O O O O O O O O O O O O Al Al Co Zn O H H O H H H H H H H H H H H H H H H H H H H H H H H H H H H H
charge: 0
multiplicity: 2
keywords: QMMM pbe def2-svp d3bj
formula: H30Al2CoO72Si26Zn
InChI: InChI=1S/2Al.Co.H28O70Si26.2HO.Zn/c;;;1-71(2,3)37-81(23)53-87(29)43-75(11,12)39-73(7,8)41-83(25)45-77(15,16)47-85(27)59-86(28)48-78(17,18)46-84(26,58-94(36,61-86)63-93(35,57-83)60-85)42-74(9,10)40-76(13,14)44-88(30)54-82(24,38-72(4,5)6)56-90(32)50-80(21,22)52-92(34)62-91(33)51-79(19,20)49-89(31,55-81)66-95(64-87,68-91)70-96(65-88,67-90)69-92;;;/h;;;1-2,4-5,7,9,11-28,31-34H;2*1H;/q+2;+3;;-5;;;
132 atoms
Si -1.654101 13.016058 3.477237
Si 3.124984 15.772766 6.536257
Si 5.247662 9.09694 -1.524354
Si 5.318787 14.543551 1.572972
Si 1.57138 10.558995 11.577845
Si 3.695086 11.806065 -1.531684
Si -1.514678 10.518976 8.442938
Si 3.118434 15.813519 3.45937
Si -1.548053 13.077624 6.581912
Si 5.293414 14.495599 -1.541706
Si 3.120538 7.880533 11.575298
Si -1.562092 10.517404 11.571514
Si 3.091748 7.876289 8.480217
Si 5.349958 9.160313 1.509913
Si 5.285441 6.617237 6.611247
Si 1.550484 10.537438 8.481059
Si 3.868276 11.912714 1.496163
Si 1.54094 13.047831 6.592651
Si 1.541173 5.228531 8.447311
Si 8.414929 6.613404 6.544879
Si 3.619062 3.845058 3.496094
Si 8.38268 9.14083 -1.535714
Si 1.51419 5.189494 11.575146
Si 3.744025 3.920446 6.593807
Si 8.443606 6.595545 3.441195
Si 8.418624 9.122315 1.586816
O  -2.434269 11.568398 12.406488
O  2.457315 6.457049 11.953916
O  0.006574 10.697993 11.954725
O  5.008854 7.181436 5.095095
O  6.841291 14.86225 2.096708
O  -2.491882 9.325826 7.919128
O  2.664672 17.286326 2.925953
O  4.382492 13.223545 -1.939115
O  4.772262 10.622981 -1.792073
O  6.822197 8.981891 -1.916003
O  4.416264 8.045744 -2.419437
O  4.481961 8.060677 12.428788
O  3.626939 15.94777 4.999919
O  -2.560812 11.918066 2.7363
O  4.397067 15.457346 2.492255
O  1.933443 16.829257 6.902859
O  5.204918 14.970275 0.006017
O  -1.858413 11.811905 7.547134
O  2.40783 11.648177 12.431267
O  -1.971174 14.57254 3.089705
O  6.823704 14.0074 -1.927127
O  -1.944627 12.740607 5.066942
O  4.458314 15.958959 7.417649
O  4.807332 15.757479 -2.408313
O  2.045133 9.045653 11.909587
O  -1.894647 8.951652 11.921929
O  -2.476396 14.283157 7.144097
O  5.040436 8.641492 0.018483
O  1.902752 6.809117 8.271126
O  6.918256 6.177118 3.267718
O  4.409442 7.561231 7.593029
O  2.500701 14.3171 6.886171
O  6.856078 6.792624 6.955058
O  4.914987 5.059908 6.722356
O  4.454175 10.454624 1.862909
O  1.835284 12.455178 5.087239
O  2.525274 9.325528 7.998238
O  0.033506 10.036971 8.269755
O  4.207153 5.290135 3.143055
O  6.886029 9.638867 1.711513
O  1.950591 14.737817 3.36699
O  3.5725 7.927279 10.012672
O  0.020651 13.536681 6.724576
O  1.926765 11.847593 7.606902
O  3.22756 11.888738 0.019834
O  1.835139 10.924946 10.014163
O  -0.111483 12.813277 3.102255
O  4.891619 8.076795 2.613555
O  5.116313 12.935986 1.652211
O  8.778733 6.93953 4.995156
O  1.989229 3.90963 12.410815
O  0.019792 4.983228 7.919642
O  9.48198 5.454477 2.916557
O  8.724389 10.709825 -1.925066
O  9.264968 7.687878 7.388806
O  -0.00827 5.684494 11.925498
O  8.735274 5.055165 6.916011
O  2.217982 3.613281 2.748967
O  3.23976 3.724091 5.084624
O  4.818437 2.806607 3.097828
O  9.240502 8.092668 -2.400247
O  8.739476 8.840627 0.016459
O  1.641085 4.793132 9.999858
O  4.336927 2.519303 7.156402
O  9.398197 10.326149 2.115674
O  2.49198 4.279844 7.56058
O  8.829342 7.881775 2.494942
O  2.771045 12.201272 2.629155
O  2.358046 11.598344 -2.407884
O  -1.839905 10.827375 9.995401
Al 5.26771 6.549128 3.440499
Al 1.50524 13.091654 3.454322
Co 3.113287 11.177292 4.543666
Zn 4.321265 8.838822 4.492625
O  4.948528 10.579639 4.552635
H  2.673215 9.409163 6.230711
H  5.459512 10.888941 3.801695
O  2.735597 9.445042 5.259216
H  -3.170413 11.699516 13.037758
H  7.720757 14.643568 1.77133
H  -2.844011 8.481453 8.248145
H  2.02056 17.93995 3.244642
H  3.657737 7.943298 -3.030461
H  4.930082 8.668163 13.047188
H  -3.223921 11.850507 2.041781
H  1.714072 17.745114 6.695744
H  3.159233 11.733251 13.048236
H  -2.62383 15.239615 3.313884
H  7.710607 14.283664 -1.699622
H  4.920083 16.547543 8.036094
H  5.070378 16.460783 -3.025757
H  -2.59147 8.326361 11.710196
H  -2.837463 15.120383 6.797751
H  1.734949 3.204434 13.039588
H  -0.888146 5.097072 8.248362
H  9.731176 4.574654 3.240669
H  9.410828 11.336468 -1.698751
H  9.990175 7.788846 8.023898
H  -0.897299 5.392033 11.711705
H  9.415431 4.408939 6.701305
H  1.83439 3.077559 2.047138
H  5.072362 1.90689 3.317319
H  9.97983 7.96314 -3.022347
H  4.871467 1.783839 6.802954
H  9.695748 11.177365 1.779349
H  1.893616 10.993633 -3.025576
exchangeener: -1298.654122611652 hartree
correlationener: -38.757813729991 hartree
xcener: -1337.411936341643 hartree
s2: 1.468256
chargesum: -0.0000000
charge: 0.796971 0.780899 0.836538 0.792848 0.827442 0.842733 0.813488 0.825016 0.807486 0.774009 0.827040 0.793828 0.874782 0.890610 0.955674 0.878295 0.870333 0.960695 0.813046 0.773962 0.793707 0.777037 0.793311 0.807012 0.822751 0.794833 -0.304877 -0.424278 -0.424550 -0.648445 -0.314704 -0.312556 -0.321962 -0.426093 -0.472308 -0.425500 -0.305769 -0.312846 -0.460884 -0.301412 -0.407113 -0.364551 -0.448982 -0.406640 -0.312796 -0.373090 -0.368106 -0.444065 -0.317692 -0.304253 -0.463864 -0.360376 -0.312816 -0.434408 -0.473187 -0.504183 -0.428320 -0.421975 -0.419802 -0.462761 -0.457917 -0.627598 -0.491148 -0.473775 -0.473272 -0.483473 -0.503866 -0.442148 -0.460020 -0.424932 -0.438367 -0.441547 -0.476208 -0.571446 -0.479394 -0.458614 -0.304699 -0.312880 -0.319620 -0.367745 -0.316141 -0.360268 -0.361526 -0.300217 -0.443206 -0.373774 -0.307212 -0.449370 -0.447064 -0.313117 -0.315900 -0.406042 -0.406430 -0.541335 -0.306598 -0.447793 0.837020 0.843862 0.516844 0.712334 -0.418479 0.239590 0.186257 -0.471970 0.207410 0.122274 0.146503 0.162766 0.183811 0.174639 0.189495 0.162341 0.174559 0.155174 0.114810 0.190875 0.189880 0.135215 0.171923 0.207382 0.147137 0.162210 0.115418 0.190677 0.135469 0.160999 0.190406 0.156177 0.192394 0.172005 0.122732 0.185345
charge: 0.424377 0.435636 0.460719 0.446105 0.457624 0.462060 0.460026 0.445904 0.461606 0.434719 0.457697 0.444250 0.468314 0.450199 0.494335 0.469120 0.444605 0.496428 0.459491 0.433833 0.422589 0.436174 0.443783 0.461770 0.446207 0.447731 -0.157102 -0.237807 -0.238039 -0.291642 -0.185033 -0.176853 -0.183001 -0.238515 -0.255366 -0.238228 -0.165881 -0.171833 -0.261705 -0.155464 -0.227626 -0.192991 -0.256224 -0.228482 -0.171770 -0.193452 -0.205928 -0.249299 -0.169252 -0.160812 -0.253084 -0.193910 -0.173002 -0.231185 -0.253738 -0.265036 -0.243514 -0.237144 -0.237292 -0.246395 -0.247825 -0.227244 -0.242597 -0.253601 -0.251351 -0.256786 -0.267142 -0.240385 -0.244043 -0.239856 -0.232146 -0.240475 -0.253134 -0.275778 -0.258126 -0.259617 -0.156912 -0.177003 -0.180371 -0.206263 -0.167945 -0.193933 -0.190979 -0.153940 -0.249326 -0.194077 -0.162923 -0.256401 -0.253252 -0.173295 -0.184863 -0.228371 -0.228898 -0.238119 -0.166404 -0.253687 0.204916 0.202662 0.403800 0.697092 -0.219264 0.045064 0.053783 -0.231679 0.121957 0.056176 0.077750 0.084217 0.107006 0.098440 0.101167 0.079668 0.098450 0.072938 0.045706 0.106093 0.107804 0.060962 0.093806 0.121917 0.078208 0.083636 0.046070 0.105260 0.061120 0.077993 0.101806 0.073506 0.110626 0.093905 0.057171 0.108636
qa: 0.7970 0.7809 0.8365 0.7928 0.8274 0.8427 0.8135 0.8250 0.8075 0.7740 0.8270 0.7938 0.8748 0.8906 0.9557 0.8783 0.8703 0.9607 0.8130 0.7740 0.7937 0.7770 0.7933 0.8070 0.8228 0.7948 -0.3049 -0.4243 -0.4245 -0.6484 -0.3147 -0.3126 -0.3220 -0.4261 -0.4723 -0.4255 -0.3058 -0.3128 -0.4609 -0.3014 -0.4071 -0.3646 -0.4490 -0.4066 -0.3128 -0.3731 -0.3681 -0.4441 -0.3177 -0.3043 -0.4639 -0.3604 -0.3128 -0.4344 -0.4732 -0.5042 -0.4283 -0.4220 -0.4198 -0.4628 -0.4579 -0.6276 -0.4911 -0.4738 -0.4733 -0.4835 -0.5039 -0.4421 -0.4600 -0.4249 -0.4384 -0.4415 -0.4762 -0.5714 -0.4794 -0.4586 -0.3047 -0.3129 -0.3196 -0.3677 -0.3161 -0.3603 -0.3615 -0.3002 -0.4432 -0.3738 -0.3072 -0.4494 -0.4471 -0.3131 -0.3159 -0.4060 -0.4064 -0.5413 -0.3066 -0.4478 0.8370 0.8439 0.5168 0.7123 -0.4185 0.2396 0.1863 -0.4720 0.2074 0.1223 0.1465 0.1628 0.1838 0.1746 0.1895 0.1623 0.1746 0.1552 0.1148 0.1909 0.1899 0.1352 0.1719 0.2074 0.1471 0.1622 0.1154 0.1907 0.1355 0.1610 0.1904 0.1562 0.1924 0.1720 0.1227 0.1853
va: 4.7814 4.8103 4.7624 4.8053 4.7742 4.7550 4.7810 4.7700 4.7889 4.8147 4.7748 4.7908 4.7362 4.7168 4.6151 4.7322 4.7449 4.6117 4.7814 4.8178 4.7845 4.8101 4.7915 4.7876 4.7703 4.8019 2.2539 2.2763 2.2759 2.1265 2.1829 2.2059 2.2148 2.2740 2.2478 2.2739 2.2403 2.2263 2.2362 2.2531 2.2996 2.1645 2.2450 2.2987 2.2263 2.1472 2.1176 2.2550 2.2260 2.2381 2.2544 2.1484 2.2293 2.2975 2.2560 2.2663 2.2933 2.2855 2.2878 2.2672 2.2583 2.1679 2.2309 2.2558 2.2957 2.2429 2.2662 2.2808 2.2719 2.2980 2.2932 2.2809 2.2912 2.1877 2.2464 2.2374 2.2541 2.2063 2.2169 2.1186 2.2281 2.1489 2.1672 2.2561 2.2557 2.1474 2.2360 2.2450 2.2493 2.2288 2.1808 2.2992 2.3002 2.2282 2.2408 2.2489 3.6116 3.6010 4.4417 2.2779 2.2713 1.0037 1.0376 2.2305 0.9907 1.0341 1.0234 1.0165 1.0040 1.0091 1.0016 1.0176 1.0091 1.0214 1.0414 1.0002 1.0005 1.0327 1.0114 0.9907 1.0231 1.0165 1.0411 1.0004 1.0326 1.0183 1.0011 1.0208 0.9989 1.0115 1.0339 1.0030
dispcorr: -0.265262964 hartree
dipole: -2.62196 0.30220 -2.31976 -0.85739 -0.84834 -1.70574 7.86330 -5.71492 2.14839
magnitude: 3.59255 au
magnitude: 9.13152 debye
