program: Orca
programVersion: 5.0.2
elementType: Si Si Si Si Si Si Si Si Si Si Si Si Si Si Si Si Si Si Si Si Si Si Si Si Si Si O O O O O O O O O O O O O O O O O O O O O O O O O O O O O O O O O O O O O O O O O O O O O O O O O O O O O O O O O O O O O O O O O O O O O O Al Al Co Sn O H H O H H H H H H H H H H H H H H H H H H H H H H H H H H H H
elementType: Sn
charge: 0
multiplicity: 2
keywords: QMMM pbe d3bj def2-svp
formula: H30Al2CoO72Si26Sn
InChI: InChI=1S/2Al.Co.H28O70Si26.H2O.O.Sn/c;;;1-71(2,3)37-81(23)53-87(29)43-75(11,12)39-73(7,8)41-83(25)45-77(15,16)47-85(27)59-86(28)48-78(17,18)46-84(26,58-94(36,61-86)63-93(35,57-83)60-85)42-74(9,10)40-76(13,14)44-88(30)54-82(24,38-72(4,5)6)56-90(32)50-80(21,22)52-92(34)62-91(33)51-79(19,20)49-89(31,55-81)66-95(64-87,68-91)70-96(65-88,67-90)69-92;;;/h;;;1-2,4-5,7,9,11-28,31-34H;1H2;;/q+2;+4;;-6;;;
132 atoms
Si -1.673804 13.005143 3.499363
Si 3.125312 15.775772 6.533945
Si 5.257475 9.143609 -1.557481
Si 5.287324 14.521122 1.589641
Si 1.573468 10.558092 11.566464
Si 3.717332 11.784602 -1.558885
Si -1.498468 10.515767 8.43194
Si 3.127802 15.810218 3.43477
Si -1.510395 13.079838 6.569661
Si 5.290168 14.495078 -1.531761
Si 3.110684 7.878336 11.577546
Si -1.558972 10.514156 11.566207
Si 3.092623 7.872729 8.444381
Si 5.368783 9.203132 1.553904
Si 5.281634 6.606231 6.584982
Si 1.551873 10.531889 8.453537
Si 3.797721 11.797751 1.537894
Si 1.612595 13.039357 6.539618
Si 1.540112 5.251132 8.41726
Si 8.416103 6.616187 6.526641
Si 3.640953 3.856739 3.487128
Si 8.382969 9.131475 -1.53472
Si 1.514282 5.196249 11.570097
Si 3.753266 3.928889 6.601875
Si 8.431214 6.585776 3.452079
Si 8.401961 9.129817 1.581997
O  -2.435841 11.560221 12.402168
O  2.460289 6.4509 11.977073
O  0.010754 10.699195 11.948374
O  4.854128 7.084484 5.100546
O  6.824142 14.760877 2.112887
O  -2.47927 9.319721 7.911528
O  2.645217 17.27836 2.912872
O  4.35641 13.238125 -1.917476
O  4.810065 10.655672 -1.950538
O  6.83108 8.96821 -1.943326
O  4.411779 8.056009 -2.40584
O  4.489177 8.073981 12.400371
O  3.592688 15.944065 4.989492
O  -2.55893 11.901142 2.738118
O  4.439196 15.523661 2.493363
O  1.934016 16.831595 6.912152
O  5.21365 14.951504 0.020263
O  -1.822061 11.820991 7.555578
O  2.41929 11.644751 12.413521
O  -1.99309 14.556424 3.091343
O  6.820669 14.011985 -1.930062
O  -1.997483 12.728695 5.083868
O  4.472331 15.974523 7.394623
O  4.81126 15.767201 -2.391461
O  2.041246 9.043201 11.915703
O  -1.887678 8.946158 11.917763
O  -2.400644 14.311077 7.146468
O  5.021039 8.850549 0.009193
O  1.907394 6.814845 8.123882
O  6.934832 6.050032 3.38428
O  4.431495 7.558128 7.600249
O  2.515687 14.325754 6.928179
O  6.84878 6.810881 6.90058
O  4.920709 5.042084 6.797354
O  4.467333 10.43719 2.086178
O  2.02334 12.509821 5.058842
O  2.554461 9.333149 7.958466
O  0.043065 10.004102 8.253719
O  4.177657 5.330075 3.138416
O  6.906443 9.719644 1.688117
O  2.01613 14.685546 3.266192
O  3.503658 7.887526 9.99524
O  0.069009 13.4882 6.641451
O  1.93807 11.831786 7.583602
O  3.29982 11.719507 0.005513
O  1.842918 10.889328 9.995777
O  -0.119252 12.824766 3.194813
O  5.046067 7.929053 2.444874
O  4.92051 12.953883 1.722408
O  8.808716 6.960583 4.993727
O  1.972964 3.887528 12.370333
O  0.012668 5.014271 7.890028
O  9.498808 5.464509 2.928073
O  8.734788 10.698961 -1.92928
O  9.239633 7.675011 7.417064
O  -0.008359 5.687628 11.916686
O  8.72518 5.05325 6.90149
O  2.217107 3.662094 2.73671
O  3.234417 3.801685 5.076878
O  4.809824 2.800901 3.092683
O  9.245262 8.080517 -2.395992
O  8.734491 8.820612 0.014983
O  1.647426 4.857464 9.975505
O  4.290341 2.49402 7.125977
O  9.451019 10.290757 2.092098
O  2.466043 4.274984 7.532193
O  8.756882 7.865467 2.489684
O  2.509173 11.961096 2.498259
O  2.358974 11.604652 -2.415156
O  -1.824172 10.815191 9.987803
Al 5.327855 6.586794 3.464317
Al 1.524913 13.062544 3.441967
Co 2.718025 10.811062 4.20213
Sn 2.329283 7.153872 4.230571
O  3.856909 10.180399 5.748741
H  4.32837 9.375474 5.488131
H  3.380877 9.966848 6.579384
O  2.282088 9.056592 3.936108
H  -3.171077 11.696058 13.035931
H  7.713505 14.600702 1.778171
H  -2.838678 8.478871 8.244931
H  2.012334 17.936582 3.239111
H  3.655841 7.947638 -3.024712
H  4.933134 8.673789 13.035171
H  -3.223125 11.843351 2.04255
H  1.714315 17.746103 6.699673
H  3.164079 11.731802 13.040732
H  -2.633097 15.232801 3.314577
H  7.709324 14.285603 -1.700863
H  4.92601 16.554124 8.026358
H  5.072039 16.464894 -3.018632
H  -2.588524 8.324038 11.708435
H  -2.805431 15.13219 6.798754
H  1.728071 3.195088 13.02247
H  -0.891159 5.110199 8.23584
H  9.738292 4.578897 3.245538
H  9.415225 11.331874 -1.700533
H  9.979462 7.783405 8.035847
H  -0.897337 5.393358 11.70798
H  9.411162 4.408129 6.695165
H  1.83402 3.098199 2.041955
H  5.068719 1.904478 3.315144
H  9.981842 7.958002 -3.020547
H  4.851769 1.773149 6.790089
H  9.718084 11.162399 1.76938
H  1.894008 10.9963 -3.028651
exchangeener: -1246.123701488278 hartree
correlationener: -38.286697104380 hartree
xcener: -1284.410398592658 hartree
s2: 1.440027
chargesum: -0.0000000
charge: 0.788817 0.773360 0.829265 0.796909 0.831959 0.831891 0.816660 0.821565 0.807465 0.775614 0.832222 0.795831 0.869737 0.858382 0.913570 0.869772 0.912618 0.948606 0.813205 0.773909 0.835533 0.776227 0.798659 0.801530 0.818712 0.795837 -0.305340 -0.424811 -0.424869 -0.609153 -0.318631 -0.318154 -0.321746 -0.423502 -0.467559 -0.425444 -0.317582 -0.315795 -0.457473 -0.305062 -0.406214 -0.364906 -0.448897 -0.407461 -0.313946 -0.370711 -0.369906 -0.444786 -0.318731 -0.308240 -0.462870 -0.361905 -0.319816 -0.450858 -0.485349 -0.501546 -0.433944 -0.419744 -0.411699 -0.463940 -0.440950 -0.606780 -0.511829 -0.472103 -0.538873 -0.473132 -0.503099 -0.438645 -0.463985 -0.425638 -0.441863 -0.443342 -0.471697 -0.482908 -0.466222 -0.454470 -0.307008 -0.320302 -0.324828 -0.370951 -0.317304 -0.357897 -0.367194 -0.329048 -0.469237 -0.350974 -0.309293 -0.450526 -0.446787 -0.304963 -0.323985 -0.412758 -0.405117 -0.541025 -0.312100 -0.447768 0.759272 0.808157 0.575135 0.722491 -0.203468 0.190845 0.201148 -0.569447 0.209169 0.121743 0.146501 0.159857 0.182277 0.179049 0.189963 0.161313 0.176665 0.153487 0.115374 0.189442 0.189696 0.134965 0.174816 0.211710 0.146941 0.159211 0.113716 0.190214 0.135884 0.161413 0.199509 0.164286 0.188450 0.171677 0.123126 0.182745
charge: 0.420108 0.434177 0.456275 0.449501 0.460534 0.458918 0.460614 0.444653 0.462349 0.434916 0.461636 0.445430 0.459551 0.450189 0.465777 0.466209 0.468734 0.497591 0.453096 0.432999 0.422261 0.434530 0.447990 0.450809 0.446722 0.450422 -0.157446 -0.238959 -0.238282 -0.284643 -0.186947 -0.181680 -0.182165 -0.237713 -0.256672 -0.239135 -0.176045 -0.173136 -0.259320 -0.157638 -0.229124 -0.194870 -0.256808 -0.229694 -0.172328 -0.193170 -0.208370 -0.251107 -0.170738 -0.164338 -0.253285 -0.195544 -0.178939 -0.241903 -0.258801 -0.261619 -0.249462 -0.236770 -0.233174 -0.248733 -0.234130 -0.243960 -0.251811 -0.254941 -0.257327 -0.255446 -0.264154 -0.240092 -0.245762 -0.242718 -0.235223 -0.242577 -0.251040 -0.253062 -0.249012 -0.258966 -0.158368 -0.182396 -0.186413 -0.208913 -0.170266 -0.191942 -0.195031 -0.171057 -0.257528 -0.175891 -0.165835 -0.257558 -0.253016 -0.167441 -0.192763 -0.231518 -0.226626 -0.218690 -0.171732 -0.254070 0.131429 0.180660 0.427802 0.652857 0.047126 0.085863 0.062751 -0.357323 0.123938 0.057147 0.077816 0.081903 0.106214 0.102614 0.101407 0.078599 0.100568 0.071167 0.046457 0.104711 0.108096 0.060682 0.097108 0.126151 0.077331 0.081293 0.045147 0.105610 0.061398 0.078479 0.109667 0.080513 0.107018 0.093544 0.058136 0.105961
qa: 0.7888 0.7734 0.8293 0.7969 0.8320 0.8319 0.8167 0.8216 0.8075 0.7756 0.8322 0.7958 0.8697 0.8584 0.9136 0.8698 0.9126 0.9486 0.8132 0.7739 0.8355 0.7762 0.7987 0.8015 0.8187 0.7958 -0.3053 -0.4248 -0.4249 -0.6092 -0.3186 -0.3182 -0.3217 -0.4235 -0.4676 -0.4254 -0.3176 -0.3158 -0.4575 -0.3051 -0.4062 -0.3649 -0.4489 -0.4075 -0.3139 -0.3707 -0.3699 -0.4448 -0.3187 -0.3082 -0.4629 -0.3619 -0.3198 -0.4509 -0.4853 -0.5015 -0.4339 -0.4197 -0.4117 -0.4639 -0.4410 -0.6068 -0.5118 -0.4721 -0.5389 -0.4731 -0.5031 -0.4386 -0.4640 -0.4256 -0.4419 -0.4433 -0.4717 -0.4829 -0.4662 -0.4545 -0.3070 -0.3203 -0.3248 -0.3710 -0.3173 -0.3579 -0.3672 -0.3290 -0.4692 -0.3510 -0.3093 -0.4505 -0.4468 -0.3050 -0.3240 -0.4128 -0.4051 -0.5410 -0.3121 -0.4478 0.7593 0.8082 0.5751 0.7225 -0.2035 0.1908 0.2011 -0.5694 0.2092 0.1217 0.1465 0.1599 0.1823 0.1790 0.1900 0.1613 0.1767 0.1535 0.1154 0.1894 0.1897 0.1350 0.1748 0.2117 0.1469 0.1592 0.1137 0.1902 0.1359 0.1614 0.1995 0.1643 0.1885 0.1717 0.1231 0.1827
va: 4.7940 4.8200 4.7731 4.7969 4.7685 4.7685 4.7761 4.7672 4.7873 4.8103 4.7659 4.7885 4.7399 4.7475 4.6658 4.7351 4.6762 4.6267 4.7793 4.8184 4.7350 4.8103 4.7841 4.7995 4.7643 4.8010 2.2542 2.2766 2.2762 2.1482 2.1758 2.1988 2.2119 2.2756 2.2513 2.2735 2.2249 2.2272 2.2380 2.2507 2.2999 2.1630 2.2449 2.2979 2.2266 2.1484 2.1152 2.2549 2.2231 2.2324 2.2552 2.1466 2.2220 2.2717 2.2432 2.2664 2.2847 2.2901 2.2955 2.2619 2.2879 2.1755 2.2089 2.2557 2.2194 2.2514 2.2670 2.2845 2.2641 2.2927 2.2871 2.2796 2.2953 2.2847 2.2603 2.2392 2.2547 2.1991 2.2074 2.1124 2.2251 2.1524 2.1614 2.2380 2.2326 2.1882 2.2297 2.2429 2.2509 2.2384 2.1700 2.2945 2.2996 2.2381 2.2328 2.2487 3.7298 3.6624 4.4733 2.1675 2.4062 1.0598 1.0583 2.2089 0.9896 1.0340 1.0233 1.0175 1.0046 1.0066 1.0013 1.0179 1.0080 1.0224 1.0410 1.0009 1.0003 1.0327 1.0097 0.9881 1.0230 1.0183 1.0416 1.0004 1.0326 1.0180 0.9958 1.0175 1.0010 1.0114 1.0329 1.0048
dispcorr: -0.268785534 hartree
dipole: 76.76854 -80.40717 -3.63863 178.18181 -181.21810 -3.03629 60.12588 -56.72146 3.40443
magnitude: 5.83514 au
magnitude: 14.83174 debye
