program: Orca
programVersion: 5.0.2
elementType: Si Si Si Si Si Si Si Si Si Si Si Si Si Si Si Si Si Si Si Si Si Si Si Si Si Si O O O O O O O O O O O O O O O O O O O O O O O O O O O O O O O O O O O O O O O O O O O O O O O O O O O O O O O O O O O O O O O O O O O O O O Al Al Co Ni O H H O H H H H H H H H H H H H H H H H H H H H H H H H H H H H
charge: 0
multiplicity: 2
keywords: QMMM pbe def2-svp d3bj
formula: H30Al2CoNiO72Si26
InChI: InChI=1S/2Al.Co.Ni.H28O70Si26.H2O.HO/c;;;;1-71(2,3)37-81(23)53-87(29)43-75(11,12)39-73(7,8)41-83(25)45-77(15,16)47-85(27)59-86(28)48-78(17,18)46-84(26,58-94(36,61-86)63-93(35,57-83)60-85)42-74(9,10)40-76(13,14)44-88(30)54-82(24,38-72(4,5)6)56-90(32)50-80(21,22)52-92(34)62-91(33)51-79(19,20)49-89(31,55-81)66-95(64-87,68-91)70-96(65-88,67-90)69-92;;/h;;;;1-2,4-5,7,9,11-28,31-34H;1H2;1H/q+2;+3;+1;;-5;;/p-1
132 atoms
Si -1.666527 13.000978 3.5083
Si 3.130063 15.775313 6.53774
Si 5.269005 9.125766 -1.580195
Si 5.297371 14.48668 1.589648
Si 1.572899 10.549118 11.585873
Si 3.743484 11.787088 -1.597596
Si -1.507699 10.517184 8.445242
Si 3.118099 15.770906 3.481767
Si -1.542127 13.06648 6.569038
Si 5.29216 14.494888 -1.536287
Si 3.109739 7.882955 11.581751
Si -1.559835 10.516654 11.574574
Si 3.086691 7.878099 8.467964
Si 5.366635 9.203971 1.510658
Si 5.255388 6.680986 6.547891
Si 1.560349 10.515124 8.478076
Si 3.833346 11.837728 1.495581
Si 1.58898 13.013661 6.575247
Si 1.547383 5.233424 8.43483
Si 8.40317 6.621535 6.536945
Si 3.630255 3.866899 3.495708
Si 8.391016 9.131861 -1.532273
Si 1.515386 5.187641 11.566887
Si 3.75705 3.94883 6.568148
Si 8.406062 6.603227 3.47118
Si 8.400667 9.135111 1.596026
O  -2.436116 11.568397 12.403981
O  2.45839 6.453722 11.955569
O  0.007604 10.705254 11.955586
O  4.891762 7.319733 5.103316
O  6.826176 14.794274 2.106265
O  -2.486124 9.325612 7.919098
O  2.603808 17.217769 2.930536
O  4.378938 13.23747 -1.967266
O  4.831847 10.640519 -1.958572
O  6.842238 8.955465 -1.950256
O  4.416504 8.042334 -2.417314
O  4.478402 8.065888 12.423732
O  3.648294 15.967453 5.012822
O  -2.527782 11.909179 2.70766
O  4.390019 15.426748 2.502968
O  1.932115 16.825943 6.903311
O  5.19093 14.920848 0.023772
O  -1.842222 11.822179 7.562737
O  2.414123 11.649351 12.421518
O  -1.97415 14.557795 3.108689
O  6.823203 14.011693 -1.925567
O  -2.03532 12.72115 5.085994
O  4.44606 15.944508 7.444995
O  4.817991 15.78458 -2.370684
O  2.032111 9.04046 11.946189
O  -1.893744 8.951216 11.921981
O  -2.39556 14.317871 7.149845
O  5.036268 8.796381 -0.011192
O  1.889731 6.819618 8.255596
O  6.869751 6.2181 3.382927
O  4.423564 7.562438 7.632824
O  2.505166 14.309371 6.863669
O  6.835809 6.823133 6.882593
O  4.895289 5.11553 6.657142
O  4.411433 10.414988 2.023358
O  2.01611 12.328704 5.122885
O  2.512447 9.315048 7.935297
O  0.038114 10.035051 8.253747
O  4.213976 5.32299 3.199439
O  6.890017 9.721687 1.698996
O  2.004594 14.637739 3.466018
O  3.524627 7.965214 10.012302
O  0.054311 13.461043 6.605416
O  1.944775 11.844372 7.632345
O  3.343369 11.743728 -0.033199
O  1.84474 10.88134 10.01392
O  -0.102212 12.780828 3.270665
O  4.941018 8.046725 2.522207
O  5.060125 12.888167 1.701596
O  8.822597 6.958492 5.002654
O  1.985385 3.905181 12.402132
O  0.020931 4.986559 7.916089
O  9.415138 5.443063 2.921015
O  8.732877 10.700526 -1.92669
O  9.23762 7.679391 7.42012
O  -0.006983 5.685157 11.918791
O  8.726681 5.059161 6.904803
O  2.242338 3.642977 2.716149
O  3.219317 3.711643 5.077257
O  4.820045 2.812208 3.101114
O  9.264234 8.078759 -2.375565
O  8.718443 8.839188 0.02544
O  1.646082 4.802076 9.990779
O  4.378394 2.561142 7.142616
O  9.419034 10.315295 2.111005
O  2.504965 4.296206 7.549952
O  8.772118 7.882203 2.498499
O  2.609712 12.129846 2.457914
O  2.381997 11.605007 -2.441818
O  -1.831656 10.82461 9.996288
Al 5.215145 6.643026 3.511871
Al 1.549776 12.987824 3.504988
Co 3.146458 10.937485 4.838804
Ni 4.124975 8.998904 4.172027
O  4.816752 10.992913 4.64225
H  2.522055 9.175638 6.132884
H  5.114586 11.193353 3.748092
O  2.508614 9.412714 5.181204
H  -3.171193 11.699516 13.036698
H  7.714366 14.614824 1.775371
H  -2.841577 8.481362 8.248132
H  1.994824 17.910961 3.24658
H  3.657838 7.941856 -3.029563
H  4.928578 8.670367 13.04505
H  -3.209954 11.846749 2.029671
H  1.713511 17.743713 6.695935
H  3.161894 11.733747 13.044113
H  -2.625088 15.23338 3.321912
H  7.710396 14.28548 -1.698963
H  4.914902 16.541432 8.047657
H  5.074886 16.472242 -3.009846
H  -2.591088 8.326177 11.710219
H  -2.803282 15.135062 6.800182
H  1.733324 3.202553 13.035916
H  -0.887665 5.09848 8.24686
H  9.702912 4.569828 3.242554
H  9.414417 11.332536 -1.699437
H  9.978611 7.785257 8.037139
H  -0.896756 5.392313 11.70887
H  9.411797 4.410629 6.696566
H  1.844689 3.090115 2.03326
H  5.073041 1.909259 3.318709
H  9.989865 7.957258 -3.01191
H  4.889002 1.801531 6.797125
H  9.704559 11.172775 1.777375
H  1.903744 10.996451 -3.039925
exchangeener: -1290.775952723498 hartree
correlationener: -38.634540758552 hartree
xcener: -1329.410493482050 hartree
s2: 1.565557
chargesum: 0.0000000
charge: 0.794660 0.781269 0.835124 0.798658 0.827332 0.827664 0.813222 0.823966 0.810022 0.775624 0.827681 0.794343 0.873350 0.903589 0.935634 0.874023 0.845064 0.974090 0.813825 0.777286 0.796192 0.774702 0.794414 0.806667 0.820897 0.797004 -0.304534 -0.424111 -0.423933 -0.596088 -0.319534 -0.314149 -0.327890 -0.422459 -0.467454 -0.422691 -0.307050 -0.313963 -0.459496 -0.302008 -0.408731 -0.365398 -0.447894 -0.405935 -0.313682 -0.376912 -0.368591 -0.444543 -0.315030 -0.306196 -0.462242 -0.360095 -0.315885 -0.435395 -0.478603 -0.501671 -0.416454 -0.418794 -0.419818 -0.463833 -0.496064 -0.635159 -0.503140 -0.474642 -0.475116 -0.475602 -0.506724 -0.440104 -0.457198 -0.426944 -0.429849 -0.441023 -0.474145 -0.524161 -0.493633 -0.458061 -0.305364 -0.316079 -0.327039 -0.369339 -0.319039 -0.361355 -0.367856 -0.305735 -0.444702 -0.377796 -0.305281 -0.447620 -0.447202 -0.318856 -0.316752 -0.407746 -0.406420 -0.480190 -0.305132 -0.446507 0.804527 0.811391 0.499168 0.491358 -0.303366 0.243958 0.191471 -0.355141 0.207897 0.122767 0.148174 0.165201 0.185216 0.175578 0.190482 0.163969 0.175818 0.157094 0.114548 0.190391 0.190823 0.136023 0.175051 0.208016 0.147036 0.164394 0.115704 0.189577 0.135123 0.162643 0.190000 0.157211 0.190770 0.173686 0.123042 0.182744
charge: 0.424481 0.436188 0.459423 0.450139 0.458092 0.454866 0.459108 0.447502 0.464776 0.434349 0.458340 0.444180 0.458739 0.453395 0.491169 0.463210 0.428309 0.503990 0.459736 0.435177 0.423686 0.434207 0.444342 0.461547 0.445049 0.449560 -0.156724 -0.237639 -0.237681 -0.246863 -0.188633 -0.177707 -0.186604 -0.236325 -0.254876 -0.236408 -0.166645 -0.172556 -0.262601 -0.155401 -0.229745 -0.194293 -0.255523 -0.228329 -0.172379 -0.197023 -0.205987 -0.251662 -0.166606 -0.162381 -0.252625 -0.193361 -0.175319 -0.230878 -0.256322 -0.265552 -0.238351 -0.234267 -0.236259 -0.244073 -0.247309 -0.212898 -0.249434 -0.254580 -0.254817 -0.254425 -0.267583 -0.240044 -0.240442 -0.240499 -0.229204 -0.239307 -0.253557 -0.212348 -0.262596 -0.260923 -0.157595 -0.180181 -0.186334 -0.207031 -0.171238 -0.194907 -0.196967 -0.159464 -0.251103 -0.198796 -0.161479 -0.255663 -0.253627 -0.178327 -0.186237 -0.229786 -0.228780 -0.247946 -0.165300 -0.252903 0.176708 0.199936 0.293908 0.420335 -0.073841 0.066254 0.058372 -0.049723 0.122335 0.057488 0.079187 0.088075 0.107641 0.099415 0.102470 0.081235 0.099315 0.075080 0.045351 0.105397 0.108727 0.061674 0.097144 0.122697 0.078416 0.086653 0.046380 0.104938 0.060788 0.080281 0.102265 0.075167 0.108584 0.096098 0.057427 0.105490
qa: 0.7947 0.7813 0.8351 0.7987 0.8273 0.8277 0.8132 0.8240 0.8100 0.7756 0.8277 0.7943 0.8734 0.9036 0.9356 0.8740 0.8451 0.9741 0.8138 0.7773 0.7962 0.7747 0.7944 0.8067 0.8209 0.7970 -0.3045 -0.4241 -0.4239 -0.5961 -0.3195 -0.3141 -0.3279 -0.4225 -0.4675 -0.4227 -0.3071 -0.3140 -0.4595 -0.3020 -0.4087 -0.3654 -0.4479 -0.4059 -0.3137 -0.3769 -0.3686 -0.4445 -0.3150 -0.3062 -0.4622 -0.3601 -0.3159 -0.4354 -0.4786 -0.5017 -0.4165 -0.4188 -0.4198 -0.4638 -0.4961 -0.6352 -0.5031 -0.4746 -0.4751 -0.4756 -0.5067 -0.4401 -0.4572 -0.4269 -0.4298 -0.4410 -0.4741 -0.5242 -0.4936 -0.4581 -0.3054 -0.3161 -0.3270 -0.3693 -0.3190 -0.3614 -0.3679 -0.3057 -0.4447 -0.3778 -0.3053 -0.4476 -0.4472 -0.3189 -0.3168 -0.4077 -0.4064 -0.4802 -0.3051 -0.4465 0.8045 0.8114 0.4992 0.4914 -0.3034 0.2440 0.1915 -0.3551 0.2079 0.1228 0.1482 0.1652 0.1852 0.1756 0.1905 0.1640 0.1758 0.1571 0.1145 0.1904 0.1908 0.1360 0.1751 0.2080 0.1470 0.1644 0.1157 0.1896 0.1351 0.1626 0.1900 0.1572 0.1908 0.1737 0.1230 0.1827
va: 4.7866 4.8106 4.7653 4.7983 4.7747 4.7740 4.7806 4.7692 4.7852 4.8112 4.7740 4.7902 4.7370 4.6917 4.6477 4.7372 4.7702 4.5867 4.7805 4.8154 4.7856 4.8125 4.7899 4.7899 4.7706 4.7981 2.2548 2.2766 2.2766 2.1895 2.1762 2.2057 2.2073 2.2773 2.2531 2.2776 2.2417 2.2259 2.2373 2.2530 2.2977 2.1650 2.2462 2.2995 2.2270 2.1442 2.1170 2.2561 2.2296 2.2365 2.2563 2.1496 2.2282 2.2973 2.2520 2.2661 2.3037 2.2907 2.2866 2.2652 2.2273 2.1741 2.2229 2.2535 2.2908 2.2532 2.2605 2.2817 2.2758 2.2954 2.2975 2.2820 2.2895 2.2523 2.2330 2.2383 2.2535 2.2017 2.2082 2.1171 2.2224 2.1473 2.1600 2.2477 2.2552 2.1430 2.2376 2.2460 2.2488 2.2225 2.1799 2.2977 2.3001 2.2837 2.2419 2.2499 3.6669 3.6469 4.6872 3.7284 2.4152 1.0149 1.0466 2.4079 0.9904 1.0335 1.0226 1.0146 1.0036 1.0087 1.0008 1.0167 1.0085 1.0204 1.0415 1.0006 0.9998 1.0324 1.0100 0.9903 1.0230 1.0150 1.0409 1.0008 1.0327 1.0172 1.0010 1.0202 0.9999 1.0103 1.0337 1.0049
dispcorr: -0.265593084 hartree
dipole: -0.32901 -2.37010 -2.69911 -2.68156 1.39456 -1.28700 5.81059 -3.42207 2.38852
magnitude: 3.82709 au
magnitude: 9.72769 debye
