program: Orca
programVersion: 5.0.2
elementType: Si Si Si Si Si Si Si Si Si Si Si Si Si Si Si Si Si Si Si Si Si Si Si Si Si Si O O O O O O O O O O O O O O O O O O O O O O O O O O O O O O O O O O O O O O O O O O O O O O O O O O O O O O O O O O O O O O O O O O O O O O Al Al Co Ga O O C H H H H H H H H H H H H H H H H H H H H H H H H H H H H H H H H
charge: 0
multiplicity: 1
keywords: QMMM pbe d3bj def2-svp
formula: CH32Al2CoGaO72Si26
InChI: InChI=1S/CH4.2Al.Co.Ga.H28O70Si26.O2/c;;;;;1-71(2,3)37-81(23)53-87(29)43-75(11,12)39-73(7,8)41-83(25)45-77(15,16)47-85(27)59-86(28)48-78(17,18)46-84(26,58-94(36,61-86)63-93(35,57-83)60-85)42-74(9,10)40-76(13,14)44-88(30)54-82(24,38-72(4,5)6)56-90(32)50-80(21,22)52-92(34)62-91(33)51-79(19,20)49-89(31,55-81)66-95(64-87,68-91)70-96(65-88,67-90)69-92;1-2/h1H4;;;;;1-2,4-5,7,9,11-28,31-34H;/q;+2;+4;+2;;-6;-2
135 atoms
Si -1.680462 13.008883 3.486806
Si 3.129112 15.772253 6.514702
Si 5.248311 9.1537 -1.541898
Si 5.312102 14.539551 1.579219
Si 1.578703 10.570439 11.549315
Si 3.71292 11.792501 -1.567003
Si -1.470883 10.502785 8.426326
Si 3.159337 15.858226 3.444116
Si -1.506805 13.060234 6.554989
Si 5.288894 14.499293 -1.540743
Si 3.097724 7.875438 11.592738
Si -1.554383 10.51984 11.557765
Si 3.13402 7.842726 8.455367
Si 5.341628 9.209169 1.587472
Si 5.30231 6.577467 6.609936
Si 1.600215 10.496861 8.44327
Si 3.85602 11.828959 1.519564
Si 1.618174 12.976146 6.507087
Si 1.553945 5.249921 8.43046
Si 8.429243 6.620924 6.52526
Si 3.607958 3.882123 3.511437
Si 8.372863 9.142578 -1.528508
Si 1.507312 5.206818 11.590103
Si 3.756946 3.94288 6.611116
Si 8.395244 6.585719 3.45428
Si 8.366391 9.140978 1.597198
O  -2.444921 11.564663 12.384414
O  2.434788 6.463238 12.02629
O  0.012694 10.716223 11.936313
O  4.827717 7.02425 5.146062
O  6.836602 14.811948 2.109349
O  -2.4531 9.308123 7.903021
O  2.670866 17.31292 2.90221
O  4.343918 13.251036 -1.923017
O  4.802335 10.670136 -1.954141
O  6.817369 8.980987 -1.934674
O  4.398633 8.071158 -2.390424
O  4.46904 8.069917 12.426964
O  3.647489 15.994575 4.987161
O  -2.533433 11.897085 2.70789
O  4.43424 15.515932 2.483049
O  1.921181 16.813631 6.877227
O  5.208611 14.956681 0.014464
O  -1.811835 11.807474 7.534565
O  2.422164 11.657706 12.403599
O  -1.991373 14.560839 3.084218
O  6.818288 14.015532 -1.92839
O  -1.997598 12.718293 5.0627
O  4.437845 15.95408 7.430839
O  4.805859 15.77548 -2.388754
O  2.036096 9.058303 11.907272
O  -1.890184 8.954111 11.909248
O  -2.36582 14.314816 7.124489
O  4.986965 8.915702 0.027176
O  1.929078 6.8051 8.105401
O  6.880519 6.12423 3.379075
O  4.509616 7.474498 7.717055
O  2.533246 14.285059 6.778391
O  6.872827 6.796114 6.914005
O  4.962464 5.003085 6.841274
O  4.398588 10.442888 2.120054
O  1.987625 12.389682 4.991168
O  2.590137 9.304833 8.009787
O  0.069745 10.016981 8.233068
O  4.165716 5.312582 3.098801
O  6.87125 9.749425 1.703937
O  2.008779 14.756289 3.331813
O  3.497086 7.842442 10.023255
O  0.085081 13.453186 6.561471
O  1.963122 11.824736 7.571465
O  3.30942 11.759859 0.011387
O  1.835303 10.924301 9.981638
O  -0.11905 12.839686 3.162167
O  4.983849 7.958966 2.468465
O  4.996387 12.956959 1.720036
O  8.817082 6.95112 4.986264
O  1.969726 3.893585 12.380551
O  0.022499 5.019666 7.899955
O  9.444313 5.450532 2.91482
O  8.72021 10.713208 -1.925384
O  9.267528 7.696094 7.386004
O  -0.017992 5.690121 11.939733
O  8.748542 5.064256 6.915942
O  2.186747 3.58243 2.804576
O  3.187047 3.90247 5.106863
O  4.795216 2.815005 3.169595
O  9.24255 8.100617 -2.393573
O  8.700344 8.843024 0.024481
O  1.63873 4.878936 9.995848
O  4.261461 2.480133 7.098467
O  9.414681 10.307609 2.101277
O  2.486888 4.251273 7.586943
O  8.734571 7.874877 2.48697
O  2.588334 12.081516 2.522067
O  2.335393 11.601393 -2.389285
O  -1.816086 10.817906 9.97326
Al 5.228572 6.594051 3.494401
Al 1.503137 13.151246 3.40828
Co 2.436264 10.881631 4.0459
Ga 2.249508 6.958229 5.083483
O  2.006245 9.337183 3.839929
O  2.269691 9.520259 5.168908
C  -1.093819 6.75296 4.861757
H  -0.727591 5.795903 5.222327
H  -0.771117 7.544305 5.532782
H  -2.174265 6.743254 4.816028
H  -0.697131 6.939424 3.868693
H  -3.174917 11.697936 13.028424
H  7.718774 14.622298 1.776675
H  -2.827612 8.473967 8.241334
H  2.02318 17.951195 3.234602
H  3.650282 7.954044 -3.018193
H  4.924619 8.672071 13.046416
H  -3.212344 11.841636 2.029768
H  1.708887 17.738507 6.684905
H  3.165294 11.73728 13.036536
H  -2.632371 15.234668 3.311564
H  7.708318 14.287103 -1.700156
H  4.911428 16.54548 8.041672
H  5.069755 16.468394 -3.017487
H  -2.589583 8.327401 11.704834
H  -2.790706 15.133771 6.78946
H  1.726702 3.197649 13.026791
H  -0.887002 5.11248 8.240037
H  9.715248 4.572986 3.239934
H  9.409061 11.337899 -1.698885
H  9.991257 7.79232 8.022713
H  -0.901411 5.394412 11.717725
H  9.421041 4.412783 6.701276
H  1.821182 3.064513 2.070652
H  5.062543 1.910441 3.347666
H  9.980695 7.966501 -3.019525
H  4.839556 1.767276 6.778457
H  9.702719 11.169525 1.773262
H  1.884037 10.994922 -3.017711
exchangeener: -1308.029209672987 hartree
correlationener: -39.031034488066 hartree
xcener: -1347.060244161053 hartree
chargesum: -0.0000000
charge: 0.789913 0.784694 0.830211 0.791676 0.829301 0.836433 0.821456 0.820957 0.814180 0.774990 0.823007 0.799534 0.881758 0.862069 0.917456 0.874442 0.905101 0.967281 0.831006 0.767425 0.828411 0.780260 0.793079 0.806129 0.814914 0.798686 -0.309034 -0.422742 -0.426880 -0.570645 -0.311750 -0.322822 -0.314544 -0.423908 -0.467646 -0.426378 -0.317722 -0.313820 -0.457363 -0.299551 -0.402484 -0.368657 -0.447705 -0.409995 -0.318235 -0.367911 -0.367672 -0.444865 -0.315888 -0.305086 -0.463008 -0.361875 -0.320625 -0.454522 -0.510292 -0.506618 -0.413428 -0.419284 -0.403846 -0.469733 -0.448673 -0.610829 -0.436210 -0.483430 -0.504798 -0.479925 -0.498036 -0.431996 -0.467478 -0.410815 -0.443102 -0.448083 -0.477406 -0.460846 -0.462579 -0.454158 -0.305934 -0.325470 -0.333270 -0.373402 -0.318833 -0.355968 -0.365639 -0.322616 -0.476908 -0.363151 -0.312008 -0.450848 -0.436540 -0.301022 -0.326010 -0.420321 -0.408169 -0.552660 -0.312700 -0.447798 0.744945 0.814483 0.622445 0.440661 -0.154431 -0.191812 -0.208486 0.071156 0.044292 0.052233 0.072337 0.210198 0.123996 0.148090 0.161578 0.182706 0.175197 0.190548 0.166622 0.176557 0.155601 0.117660 0.194711 0.189509 0.135258 0.177672 0.209858 0.148948 0.160163 0.112581 0.187119 0.133037 0.157197 0.194220 0.157469 0.190943 0.169459 0.119533 0.185542
charge: 0.419865 0.442103 0.458068 0.446832 0.460074 0.459728 0.462134 0.445851 0.465676 0.434423 0.455488 0.447286 0.461001 0.448919 0.470538 0.472012 0.466998 0.511661 0.455249 0.428064 0.419560 0.435905 0.444821 0.443395 0.447260 0.453767 -0.161003 -0.237547 -0.240410 -0.247036 -0.180454 -0.182582 -0.176011 -0.237986 -0.256962 -0.239347 -0.175817 -0.171775 -0.260242 -0.152318 -0.225765 -0.196312 -0.255098 -0.231296 -0.176603 -0.189461 -0.205043 -0.250814 -0.167462 -0.161316 -0.253223 -0.195741 -0.179059 -0.244114 -0.248659 -0.270831 -0.229323 -0.234299 -0.229358 -0.248421 -0.242766 -0.213747 -0.234666 -0.257613 -0.250576 -0.258694 -0.257355 -0.238045 -0.246325 -0.234333 -0.234171 -0.246034 -0.250643 -0.251318 -0.246873 -0.260110 -0.157513 -0.183009 -0.191823 -0.211644 -0.171637 -0.191525 -0.193895 -0.168120 -0.247071 -0.186189 -0.168182 -0.258084 -0.249804 -0.167812 -0.195145 -0.227484 -0.230593 -0.214769 -0.171768 -0.255365 0.174736 0.193159 0.300430 0.373923 0.053455 -0.052054 -0.124098 0.036768 0.026675 0.041432 0.043521 0.125212 0.057689 0.078986 0.082475 0.107253 0.099410 0.101137 0.083638 0.100585 0.072558 0.048553 0.110171 0.107305 0.061478 0.100567 0.124291 0.079599 0.083117 0.043988 0.102211 0.058682 0.074578 0.105913 0.076687 0.110405 0.091641 0.055601 0.108036
qa: 0.7899 0.7847 0.8302 0.7917 0.8293 0.8364 0.8215 0.8210 0.8142 0.7750 0.8230 0.7995 0.8818 0.8621 0.9175 0.8744 0.9051 0.9673 0.8310 0.7674 0.8284 0.7803 0.7931 0.8061 0.8149 0.7987 -0.3090 -0.4227 -0.4269 -0.5706 -0.3117 -0.3228 -0.3145 -0.4239 -0.4676 -0.4264 -0.3177 -0.3138 -0.4574 -0.2996 -0.4025 -0.3687 -0.4477 -0.4100 -0.3182 -0.3679 -0.3677 -0.4449 -0.3159 -0.3051 -0.4630 -0.3619 -0.3206 -0.4545 -0.5103 -0.5066 -0.4134 -0.4193 -0.4038 -0.4697 -0.4487 -0.6108 -0.4362 -0.4834 -0.5048 -0.4799 -0.4980 -0.4320 -0.4675 -0.4108 -0.4431 -0.4481 -0.4774 -0.4608 -0.4626 -0.4542 -0.3059 -0.3255 -0.3333 -0.3734 -0.3188 -0.3560 -0.3656 -0.3226 -0.4769 -0.3632 -0.3120 -0.4508 -0.4365 -0.3010 -0.3260 -0.4203 -0.4082 -0.5527 -0.3127 -0.4478 0.7449 0.8145 0.6224 0.4407 -0.1544 -0.1918 -0.2085 0.0712 0.0443 0.0522 0.0723 0.2102 0.1240 0.1481 0.1616 0.1827 0.1752 0.1905 0.1666 0.1766 0.1556 0.1177 0.1947 0.1895 0.1353 0.1777 0.2099 0.1489 0.1602 0.1126 0.1871 0.1330 0.1572 0.1942 0.1575 0.1909 0.1695 0.1195 0.1855
va: 4.7944 4.8061 4.7726 4.8041 4.7712 4.7640 4.7714 4.7680 4.7817 4.8119 4.7762 4.7840 4.7290 4.7334 4.6665 4.7351 4.6887 4.5955 4.7596 4.8254 4.7408 4.8054 4.7899 4.8027 4.7653 4.7968 2.2500 2.2784 2.2734 2.1955 2.1884 2.1957 2.2244 2.2758 2.2515 2.2731 2.2242 2.2259 2.2400 2.2593 2.3028 2.1629 2.2463 2.2963 2.2206 2.1545 2.1204 2.2552 2.2308 2.2369 2.2543 2.1461 2.2226 2.2670 2.2239 2.2557 2.3115 2.2921 2.2992 2.2581 2.2803 2.1825 2.2982 2.2456 2.2585 2.2448 2.2785 2.2871 2.2612 2.3130 2.2876 2.2734 2.2947 2.3015 2.2660 2.2381 2.2550 2.2031 2.1965 2.1090 2.2213 2.1525 2.1595 2.2398 2.2299 2.1652 2.2271 2.2422 2.2616 2.2411 2.1628 2.2932 2.2962 2.2243 2.2357 2.2496 3.7613 3.6562 3.5082 1.2585 2.3085 2.1200 3.9741 1.0135 1.0109 0.9946 0.9963 0.9888 1.0335 1.0230 1.0176 1.0045 1.0087 1.0013 1.0154 1.0078 1.0216 1.0403 0.9979 1.0006 1.0326 1.0081 0.9893 1.0230 1.0170 1.0420 1.0021 1.0338 1.0202 0.9988 1.0199 0.9993 1.0124 1.0344 1.0032
dispcorr: -0.269955012 hartree
dipole: -2.37327 -2.25035 -4.62362 5.74179 -7.15420 -1.41241 6.51710 -3.72116 2.79594
magnitude: 5.58480 au
magnitude: 14.19544 debye
