program: Orca
programVersion: 5.0.2
elementType: Si Si Si Si Si Si Si Si Si Si Si Si Si Si Si Si Si Si Si Si Si Si Si Si Si Si O O O O O O O O O O O O O O O O O O O O O O O O O O O O O O O O O O O O O O O O O O O O O O O O O O O O O O O O O O O O O O O O O O O O O O Al Al Co Ga O H H H H H H H H H H H H H H H H H H H H H H H H H H H H
charge: 0
multiplicity: 1
keywords: QMMM pbe d3bj def2-svp
formula: H28Al2CoGaO71Si26
InChI: InChI=1S/2Al.Co.Ga.H28O70Si26.O/c;;;;1-71(2,3)37-81(23)53-87(29)43-75(11,12)39-73(7,8)41-83(25)45-77(15,16)47-85(27)59-86(28)48-78(17,18)46-84(26,58-94(36,61-86)63-93(35,57-83)60-85)42-74(9,10)40-76(13,14)44-88(30)54-82(24,38-72(4,5)6)56-90(32)50-80(21,22)52-92(34)62-91(33)51-79(19,20)49-89(31,55-81)66-95(64-87,68-91)70-96(65-88,67-90)69-92;/h;;;;1-2,4-5,7,9,11-28,31-34H;/q+2;+3;;;-5;
129 atoms
Si -1.659664 13.020904 3.48576
Si 3.129417 15.780214 6.52424
Si 5.243323 9.12307 -1.521309
Si 5.296991 14.525396 1.59426
Si 1.587577 10.553202 11.542704
Si 3.691321 11.781641 -1.508559
Si -1.479058 10.500606 8.425944
Si 3.161182 15.854188 3.439362
Si -1.523699 13.0718 6.579432
Si 5.288799 14.485107 -1.528739
Si 3.106802 7.893293 11.567915
Si -1.550334 10.519062 11.556845
Si 3.093491 7.887364 8.437928
Si 5.353332 9.177802 1.57801
Si 5.279401 6.617231 6.595763
Si 1.597154 10.483729 8.411624
Si 3.804186 11.809496 1.587695
Si 1.576204 13.030419 6.564591
Si 1.544704 5.245194 8.434546
Si 8.425504 6.618302 6.534399
Si 3.620579 3.856221 3.504122
Si 8.378108 9.139096 -1.528612
Si 1.516044 5.194914 11.567355
Si 3.74304 3.9222 6.582879
Si 8.433728 6.600671 3.463911
Si 8.407714 9.124268 1.593502
O  -2.434517 11.561468 12.393882
O  2.461802 6.461088 11.947561
O  0.021635 10.720516 11.917491
O  4.894947 7.257593 5.140738
O  6.8303 14.76689 2.11831
O  -2.47696 9.319243 7.911913
O  2.670749 17.311817 2.904377
O  4.344373 13.226302 -1.886582
O  4.782798 10.642756 -1.868722
O  6.816745 8.974631 -1.908907
O  4.400368 8.053125 -2.389357
O  4.478804 8.074349 12.408618
O  3.628681 15.981621 4.989866
O  -2.529401 11.920286 2.707995
O  4.450392 15.53997 2.487241
O  1.928039 16.824734 6.893301
O  5.211079 14.942342 0.025387
O  -1.824681 11.803952 7.537736
O  2.436116 11.653074 12.379311
O  -1.973417 14.57502 3.090479
O  6.819523 13.998362 -1.917568
O  -1.952297 12.734948 5.067479
O  4.457103 15.963755 7.413119
O  4.816164 15.753817 -2.396279
O  2.032058 9.04825 11.944974
O  -1.888654 8.954298 11.910995
O  -2.437527 14.291836 7.136173
O  5.003744 8.795617 0.045034
O  1.896657 6.82464 8.241386
O  6.902542 6.187062 3.383034
O  4.470131 7.501716 7.686027
O  2.521521 14.311415 6.846313
O  6.857517 6.79505 6.896795
O  4.924017 5.052343 6.681064
O  4.438251 10.423063 2.10067
O  1.904379 12.459671 5.054778
O  2.585244 9.324095 7.849576
O  0.062768 10.015066 8.232422
O  4.220551 5.307289 3.217199
O  6.889661 9.674193 1.711605
O  2.026908 14.740978 3.29356
O  3.499891 7.990449 9.993575
O  0.049628 13.521363 6.674998
O  1.943623 11.844518 7.590864
O  3.272372 11.748855 0.063082
O  1.873483 10.835065 9.961725
O  -0.102514 12.841458 3.152076
O  4.902433 8.022983 2.574952
O  4.931864 12.95843 1.760828
O  8.838893 6.955178 5.001189
O  1.983724 3.911528 12.403955
O  0.020567 4.985232 7.917308
O  9.451332 5.447808 2.9169
O  8.720994 10.709555 -1.920574
O  9.246793 7.691192 7.41036
O  -0.007424 5.686928 11.921997
O  8.741861 5.061137 6.915774
O  2.232613 3.644307 2.72153
O  3.212673 3.702077 5.086335
O  4.806431 2.803443 3.098398
O  9.235954 8.097054 -2.402985
O  8.732137 8.835627 0.021381
O  1.64442 4.811441 9.98933
O  4.337011 2.522526 7.153572
O  9.41871 10.312428 2.10838
O  2.499516 4.292536 7.558183
O  8.803832 7.873216 2.492673
O  2.55555 11.979185 2.603189
O  2.334552 11.585021 -2.365746
O  -1.815519 10.82003 9.974413
Al 5.253859 6.605244 3.522627
Al 1.528223 13.138687 3.434646
Co 1.850312 10.769101 4.203338
Ga 3.429063 8.801361 4.628128
O  1.509135 9.35245 4.714978
H  -3.170517 11.696586 13.032427
H  7.716109 14.603245 1.780464
H  -2.837701 8.478669 8.245094
H  2.02313 17.950729 3.235518
H  3.651016 7.946419 -3.017742
H  4.928747 8.673944 13.038659
H  -3.210639 11.851446 2.029812
H  1.711787 17.743202 6.691702
H  3.171193 11.735321 13.026266
H  -2.624778 15.240664 3.314212
H  7.708839 14.279843 -1.69558
H  4.919571 16.54957 8.034179
H  5.074113 16.459234 -3.020669
H  -2.588936 8.32748 11.705573
H  -2.821027 15.124053 6.794401
H  1.732621 3.205237 13.036687
H  -0.887819 5.097919 8.247375
H  9.718216 4.571834 3.240814
H  9.409393 11.336354 -1.696851
H  9.98249 7.790247 8.033012
H  -0.896942 5.393062 11.710225
H  9.418216 4.411464 6.701205
H  1.840577 3.090678 2.035536
H  5.067285 1.905552 3.31756
H  9.977906 7.964994 -3.023504
H  4.871503 1.785202 6.801758
H  9.704422 11.171563 1.776265
H  1.883682 10.9880 -3.007758
exchangeener: -1293.308790906008 hartree
correlationener: -38.447650371074 hartree
xcener: -1331.756441277082 hartree
chargesum: -0.0000000
charge: 0.795215 0.776548 0.839112 0.791976 0.831639 0.840056 0.815772 0.816437 0.807440 0.781566 0.827560 0.801376 0.873790 0.879974 0.937017 0.882280 0.909279 0.960874 0.811740 0.770521 0.790952 0.779993 0.796371 0.801616 0.819558 0.796243 -0.310268 -0.424930 -0.427221 -0.583809 -0.314992 -0.315918 -0.316520 -0.426847 -0.469329 -0.426188 -0.314432 -0.318717 -0.455552 -0.302755 -0.401914 -0.364823 -0.449112 -0.407690 -0.323066 -0.368092 -0.370161 -0.446972 -0.315817 -0.309611 -0.462142 -0.362973 -0.316390 -0.446761 -0.478187 -0.499889 -0.420509 -0.414975 -0.408728 -0.457493 -0.440813 -0.590214 -0.455272 -0.477299 -0.480410 -0.468376 -0.492686 -0.442402 -0.466200 -0.416719 -0.452109 -0.452200 -0.485736 -0.510921 -0.466127 -0.455761 -0.307594 -0.315452 -0.322838 -0.370641 -0.316269 -0.361141 -0.362118 -0.305388 -0.444889 -0.373956 -0.309743 -0.450075 -0.447976 -0.313785 -0.319771 -0.405509 -0.404832 -0.540026 -0.316410 -0.448783 0.762820 0.789555 0.501960 0.572180 -0.385676 0.210582 0.121872 0.147168 0.160918 0.185672 0.176261 0.192189 0.163537 0.178450 0.155263 0.116952 0.192228 0.192918 0.136355 0.173884 0.208858 0.147619 0.162216 0.114751 0.190345 0.135053 0.161266 0.191834 0.156607 0.192178 0.172680 0.122442 0.187381
charge: 0.419389 0.437358 0.462232 0.448312 0.462861 0.464793 0.461547 0.444940 0.460889 0.437946 0.458347 0.448221 0.465679 0.463009 0.493522 0.475907 0.472716 0.497641 0.458598 0.431887 0.421278 0.437122 0.445325 0.459120 0.446220 0.450001 -0.162209 -0.238520 -0.240694 -0.203819 -0.183370 -0.178891 -0.177391 -0.240357 -0.257051 -0.239359 -0.172799 -0.176752 -0.259093 -0.154200 -0.226075 -0.192982 -0.256346 -0.228864 -0.180551 -0.190826 -0.208277 -0.251057 -0.167543 -0.165272 -0.254147 -0.196543 -0.175943 -0.239897 -0.253639 -0.262797 -0.234302 -0.232993 -0.230906 -0.243159 -0.236055 -0.206257 -0.241369 -0.254521 -0.254784 -0.251126 -0.255598 -0.243522 -0.247429 -0.238211 -0.241312 -0.247872 -0.251529 -0.227570 -0.247918 -0.259762 -0.159700 -0.179205 -0.182897 -0.208958 -0.168506 -0.195095 -0.191066 -0.158925 -0.251302 -0.195706 -0.165657 -0.257572 -0.254030 -0.174759 -0.188744 -0.227951 -0.228234 -0.227180 -0.174547 -0.255579 0.183588 0.160399 0.318219 0.370840 -0.095929 0.125906 0.056712 0.078495 0.081999 0.109310 0.100509 0.103741 0.080467 0.102687 0.072453 0.047995 0.107306 0.111576 0.062530 0.096441 0.123843 0.078654 0.084077 0.045808 0.104659 0.060951 0.078003 0.103405 0.074219 0.110957 0.094448 0.057379 0.110562
qa: 0.7952 0.7765 0.8391 0.7920 0.8316 0.8401 0.8158 0.8164 0.8074 0.7816 0.8276 0.8014 0.8738 0.8800 0.9370 0.8823 0.9093 0.9609 0.8117 0.7705 0.7910 0.7800 0.7964 0.8016 0.8196 0.7962 -0.3103 -0.4249 -0.4272 -0.5838 -0.3150 -0.3159 -0.3165 -0.4268 -0.4693 -0.4262 -0.3144 -0.3187 -0.4556 -0.3028 -0.4019 -0.3648 -0.4491 -0.4077 -0.3231 -0.3681 -0.3702 -0.4470 -0.3158 -0.3096 -0.4621 -0.3630 -0.3164 -0.4468 -0.4782 -0.4999 -0.4205 -0.4150 -0.4087 -0.4575 -0.4408 -0.5902 -0.4553 -0.4773 -0.4804 -0.4684 -0.4927 -0.4424 -0.4662 -0.4167 -0.4521 -0.4522 -0.4857 -0.5109 -0.4661 -0.4558 -0.3076 -0.3155 -0.3228 -0.3706 -0.3163 -0.3611 -0.3621 -0.3054 -0.4449 -0.3740 -0.3097 -0.4501 -0.4480 -0.3138 -0.3198 -0.4055 -0.4048 -0.5400 -0.3164 -0.4488 0.7628 0.7896 0.5020 0.5722 -0.3857 0.2106 0.1219 0.1472 0.1609 0.1857 0.1763 0.1922 0.1635 0.1785 0.1553 0.1170 0.1922 0.1929 0.1364 0.1739 0.2089 0.1476 0.1622 0.1148 0.1903 0.1351 0.1613 0.1918 0.1566 0.1922 0.1727 0.1224 0.1874
va: 4.7898 4.8152 4.7600 4.8038 4.7699 4.7580 4.7775 4.7704 4.7908 4.8035 4.7747 4.7812 4.7336 4.7112 4.6356 4.7255 4.6839 4.6074 4.7830 4.8225 4.7954 4.8057 4.7872 4.7966 4.7688 4.7987 2.2483 2.2757 2.2729 2.1570 2.1810 2.2022 2.2211 2.2725 2.2493 2.2735 2.2313 2.2204 2.2397 2.2553 2.3031 2.1654 2.2452 2.2975 2.2165 2.1561 2.1165 2.2519 2.2292 2.2327 2.2553 2.1455 2.2253 2.2789 2.2508 2.2684 2.3021 2.2960 2.2970 2.2700 2.2856 2.1902 2.2780 2.2513 2.2850 2.2576 2.2806 2.2773 2.2619 2.3049 2.2747 2.2697 2.2827 2.2510 2.2615 2.2403 2.2509 2.2033 2.2127 2.1142 2.2283 2.1473 2.1669 2.2506 2.2553 2.1473 2.2316 2.2438 2.2483 2.2284 2.1749 2.2996 2.3005 2.2291 2.2307 2.2481 3.7364 3.6886 3.8007 2.3887 2.3393 0.9885 1.0342 1.0231 1.0177 1.0029 1.0081 1.0003 1.0171 1.0067 1.0217 1.0404 0.9994 0.9984 1.0321 1.0102 0.9897 1.0228 1.0164 1.0413 1.0006 1.0327 1.0183 1.0001 1.0207 0.9988 1.0111 1.0336 1.0019
dispcorr: -0.255545952 hartree
dipole: 7.56755 -10.40050 -2.83294 3.13892 -4.49021 -1.35129 9.48872 -7.29375 2.19496
magnitude: 3.83007 au
magnitude: 9.73526 debye
