program: Orca
programVersion: 5.0.2
elementType: Si Si Si Si Si Si Si Si Si Si Si Si Si Si Si Si Si Si Si Si Si Si Si Si Si Si O O O O O O O O O O O O O O O O O O O O O O O O O O O O O O O O O O O O O O O O O O O O O O O O O O O O O O O O O O O O O O O O O O O O O O Al Al Co Ga O C H H H H H H H H H H H H H H H H H H H H H H H H H H H H H H H H
charge: 0
multiplicity: 1
keywords: QMMM pbe d3bj def2-svp
formula: CH32Al2CoGaO71Si26
InChI: InChI=1S/CH4O.2Al.Co.Ga.H28O70Si26/c1-2;;;;;1-71(2,3)37-81(23)53-87(29)43-75(11,12)39-73(7,8)41-83(25)45-77(15,16)47-85(27)59-86(28)48-78(17,18)46-84(26,58-94(36,61-86)63-93(35,57-83)60-85)42-74(9,10)40-76(13,14)44-88(30)54-82(24,38-72(4,5)6)56-90(32)50-80(21,22)52-92(34)62-91(33)51-79(19,20)49-89(31,55-81)66-95(64-87,68-91)70-96(65-88,67-90)69-92/h2H,1H3;;;;;1-2,4-5,7,9,11-28,31-34H/q;+2;+4;;;-6
134 atoms
Si -1.649845 13.016239 3.46738
Si 3.122225 15.778843 6.529727
Si 5.254363 9.125319 -1.549911
Si 5.300166 14.50811 1.594557
Si 1.573236 10.551209 11.579204
Si 3.706519 11.780156 -1.519537
Si -1.47039 10.504976 8.420282
Si 3.11632 15.812238 3.43389
Si -1.532689 13.086897 6.590814
Si 5.28993 14.484183 -1.529236
Si 3.114799 7.885633 11.564594
Si -1.554946 10.513877 11.564342
Si 3.098943 7.88947 8.438129
Si 5.368036 9.169735 1.541421
Si 5.266609 6.634959 6.546543
Si 1.600147 10.538006 8.452426
Si 3.840842 11.810759 1.582932
Si 1.538278 13.07812 6.58828
Si 1.548916 5.256075 8.427449
Si 8.416254 6.618246 6.526785
Si 3.616957 3.854652 3.49498
Si 8.384382 9.135443 -1.53482
Si 1.51558 5.193689 11.563625
Si 3.750003 3.933322 6.575957
Si 8.442799 6.597853 3.457787
Si 8.417737 9.122322 1.586789
O  -2.455751 11.563131 12.371869
O  2.461357 6.457729 11.948472
O  0.008198 10.70744 11.95787
O  4.858242 7.233194 5.089533
O  6.831344 14.797757 2.110627
O  -2.399727 9.269775 7.884644
O  2.661251 17.291255 2.91311
O  4.35278 13.224877 -1.905992
O  4.796291 10.63979 -1.900325
O  6.828856 8.968276 -1.929447
O  4.40962 8.045749 -2.404834
O  4.482201 8.073842 12.408827
O  3.591809 15.93988 4.984853
O  -2.59551 11.905873 2.777884
O  4.4169 15.484272 2.48996
O  1.929326 16.832949 6.906878
O  5.206926 14.933231 0.023908
O  -1.847398 11.770827 7.502959
O  2.417364 11.64893 12.414413
O  -1.980221 14.568786 3.091349
O  6.821764 13.999123 -1.923379
O  -1.879516 12.716789 5.067451
O  4.467983 15.976447 7.393197
O  4.817514 15.754993 -2.395472
O  2.03484 9.041254 11.929779
O  -1.889926 8.94878 11.913978
O  -2.51657 14.258429 7.129539
O  5.017614 8.782072 0.01359
O  1.88854 6.837755 8.221484
O  6.914399 6.167874 3.368338
O  4.441083 7.528111 7.626102
O  2.502841 14.333766 6.912516
O  6.84477 6.809864 6.861243
O  4.917715 5.067615 6.679433
O  4.431757 10.385757 2.080092
O  1.724547 12.52858 5.082946
O  2.538193 9.327356 7.904908
O  0.074959 10.042197 8.156394
O  4.206047 5.30267 3.173432
O  6.898451 9.666724 1.703014
O  1.967829 14.723516 3.271633
O  3.518186 7.962258 9.992253
O  0.010442 13.555776 6.814033
O  1.930791 11.861633 7.597004
O  3.313621 11.733748 0.051978
O  1.824955 10.878807 10.002727
O  -0.128583 12.796964 3.046527
O  4.905941 7.990386 2.518116
O  5.012973 12.920762 1.726699
O  8.840658 6.95551 4.995203
O  1.9791 3.905084 12.394047
O  0.01922 5.022391 7.902774
O  9.466592 5.449055 2.913467
O  8.729363 10.70408 -1.927614
O  9.237204 7.679384 7.418594
O  -0.007619 5.690502 11.916133
O  8.730518 5.057498 6.904243
O  2.215127 3.640708 2.733242
O  3.214353 3.72053 5.078771
O  4.798415 2.798533 3.091017
O  9.243473 8.086027 -2.398616
O  8.73817 8.831893 0.0155
O  1.64099 4.822397 9.981909
O  4.337515 2.529779 7.144652
O  9.42799 10.308438 2.104379
O  2.495107 4.305662 7.541985
O  8.808054 7.870783 2.488181
O  2.615989 12.014023 2.59806
O  2.343928 11.579187 -2.367984
O  -1.790809 10.797721 9.972401
Al 5.265905 6.57979 3.486787
Al 1.497213 13.095092 3.422482
Co 2.087074 10.739048 4.20949
Ga 3.369091 8.749735 4.250308
O  0.91126 9.521359 5.352897
C  -0.428418 9.423295 4.821012
H  -1.019082 8.753953 5.44686
H  0.823801 9.727392 6.296006
H  -0.910859 10.400024 4.776848
H  -0.336886 9.016666 3.814413
H  -3.179496 11.697289 13.023119
H  7.716551 14.616297 1.777215
H  -2.805043 8.457752 8.233563
H  2.019114 17.942034 3.239211
H  3.654928 7.9433 -3.024286
H  4.930184 8.67373 13.038747
H  -3.238593 11.845351 2.059365
H  1.712331 17.746676 6.697443
H  3.163264 11.733569 13.041109
H  -2.627655 15.238028 3.314579
H  7.709787 14.280164 -1.698037
H  4.924172 16.554937 8.025755
H  5.074684 16.459731 -3.020328
H  -2.589474 8.325147 11.706834
H  -2.854451 15.109927 6.791596
H  1.730666 3.202512 13.032497
H  -0.888388 5.113632 8.24123
H  9.724669 4.572362 3.239362
H  9.412932 11.334039 -1.699828
H  9.978435 7.785254 8.036494
H  -0.897024 5.394573 11.707746
H  9.41342 4.409926 6.696329
H  1.833182 3.089156 2.040488
H  5.063895 1.903476 3.314439
H  9.981086 7.960331 -3.021657
H  4.871716 1.788269 6.797986
H  9.708346 11.169875 1.774573
H  1.887646 10.985533 -3.008704
exchangeener: -1299.913235364485 hartree
correlationener: -38.769017652688 hartree
xcener: -1338.682253017173 hartree
chargesum: -0.0000000
charge: 0.820829 0.774289 0.833628 0.795196 0.828203 0.839753 0.826043 0.819445 0.810458 0.780006 0.828941 0.801003 0.875109 0.886759 0.934245 0.899293 0.911762 0.932327 0.809259 0.774762 0.786145 0.775567 0.797774 0.803316 0.819050 0.796835 -0.307122 -0.425551 -0.424487 -0.588345 -0.317400 -0.328729 -0.323738 -0.426604 -0.468709 -0.424544 -0.312488 -0.316210 -0.455234 -0.321798 -0.404536 -0.365450 -0.449995 -0.422827 -0.314245 -0.357250 -0.371059 -0.470182 -0.318522 -0.310528 -0.462714 -0.358280 -0.307354 -0.440984 -0.484194 -0.500520 -0.416740 -0.412835 -0.414096 -0.462036 -0.450497 -0.587532 -0.465748 -0.532050 -0.483205 -0.465131 -0.497594 -0.445361 -0.461833 -0.421614 -0.454211 -0.435460 -0.490295 -0.526289 -0.467393 -0.457026 -0.307077 -0.321882 -0.323201 -0.369799 -0.319102 -0.362622 -0.365918 -0.307994 -0.446452 -0.372566 -0.307654 -0.449286 -0.448652 -0.317056 -0.318012 -0.408148 -0.404283 -0.538448 -0.318103 -0.440379 0.780302 0.833226 0.196866 0.391440 -0.297316 0.080704 0.054697 0.196993 0.068677 0.080678 0.212602 0.122026 0.148661 0.160800 0.183007 0.176273 0.192713 0.160118 0.177752 0.155777 0.115913 0.191148 0.191848 0.136199 0.174590 0.209491 0.143362 0.160536 0.114529 0.189812 0.134150 0.160788 0.188879 0.155062 0.189838 0.172683 0.122153 0.186203
charge: 0.414859 0.433392 0.457774 0.450234 0.460610 0.463653 0.456870 0.447594 0.452643 0.436781 0.459834 0.449260 0.467336 0.463672 0.494154 0.451825 0.474734 0.483285 0.456949 0.433950 0.418062 0.434666 0.446127 0.458296 0.445899 0.449367 -0.158652 -0.238906 -0.238397 -0.228744 -0.186241 -0.185352 -0.183542 -0.240026 -0.256700 -0.238166 -0.171720 -0.174224 -0.258575 -0.166182 -0.228014 -0.193785 -0.257211 -0.234819 -0.172307 -0.185405 -0.209235 -0.254898 -0.170455 -0.166387 -0.253326 -0.192319 -0.170813 -0.236199 -0.260875 -0.263582 -0.236976 -0.232464 -0.234346 -0.246127 -0.231725 -0.217736 -0.250755 -0.268150 -0.254708 -0.248392 -0.262998 -0.243864 -0.248671 -0.239943 -0.242546 -0.238359 -0.255995 -0.220989 -0.249815 -0.260948 -0.159099 -0.185415 -0.183502 -0.207983 -0.171386 -0.196410 -0.194682 -0.161980 -0.252009 -0.194518 -0.163911 -0.256700 -0.254179 -0.177141 -0.187183 -0.230241 -0.227789 -0.216244 -0.176079 -0.251061 0.177879 0.171023 0.180959 0.304575 0.027169 0.075320 0.030518 0.069814 0.025644 0.040058 0.127007 0.056668 0.078131 0.082514 0.106583 0.100472 0.103330 0.077026 0.101133 0.073618 0.046942 0.106302 0.110644 0.061726 0.095993 0.124499 0.075280 0.082412 0.045642 0.105242 0.060145 0.078143 0.100529 0.073312 0.108284 0.094892 0.057144 0.109674
qa: 0.8208 0.7743 0.8336 0.7952 0.8282 0.8398 0.8260 0.8194 0.8105 0.7800 0.8289 0.8010 0.8751 0.8868 0.9342 0.8993 0.9118 0.9323 0.8093 0.7748 0.7861 0.7756 0.7978 0.8033 0.8190 0.7968 -0.3071 -0.4256 -0.4245 -0.5883 -0.3174 -0.3287 -0.3237 -0.4266 -0.4687 -0.4245 -0.3125 -0.3162 -0.4552 -0.3218 -0.4045 -0.3655 -0.4500 -0.4228 -0.3142 -0.3572 -0.3711 -0.4702 -0.3185 -0.3105 -0.4627 -0.3583 -0.3074 -0.4410 -0.4842 -0.5005 -0.4167 -0.4128 -0.4141 -0.4620 -0.4505 -0.5875 -0.4657 -0.5320 -0.4832 -0.4651 -0.4976 -0.4454 -0.4618 -0.4216 -0.4542 -0.4355 -0.4903 -0.5263 -0.4674 -0.4570 -0.3071 -0.3219 -0.3232 -0.3698 -0.3191 -0.3626 -0.3659 -0.3080 -0.4465 -0.3726 -0.3077 -0.4493 -0.4487 -0.3171 -0.3180 -0.4081 -0.4043 -0.5384 -0.3181 -0.4404 0.7803 0.8332 0.1969 0.3914 -0.2973 0.0807 0.0547 0.1970 0.0687 0.0807 0.2126 0.1220 0.1487 0.1608 0.1830 0.1763 0.1927 0.1601 0.1778 0.1558 0.1159 0.1911 0.1918 0.1362 0.1746 0.2095 0.1434 0.1605 0.1145 0.1898 0.1341 0.1608 0.1889 0.1551 0.1898 0.1727 0.1222 0.1862
va: 4.7567 4.8174 4.7671 4.8000 4.7719 4.7595 4.7703 4.7651 4.7901 4.8060 4.7723 4.7805 4.7305 4.7065 4.6408 4.7047 4.6749 4.6573 4.7863 4.8177 4.8021 4.8110 4.7858 4.7965 4.7678 4.7981 2.2551 2.2750 2.2763 2.1561 2.1778 2.1950 2.2108 2.2732 2.2503 2.2751 2.2323 2.2232 2.2395 2.2416 2.3002 2.1621 2.2439 2.2888 2.2281 2.1695 2.1147 2.2296 2.2246 2.2305 2.2552 2.1524 2.2389 2.2862 2.2419 2.2674 2.3049 2.2953 2.2909 2.2644 2.2772 2.2020 2.2695 2.2023 2.2826 2.2620 2.2720 2.2754 2.2659 2.3021 2.2729 2.2879 2.2786 2.2274 2.2598 2.2390 2.2521 2.1907 2.2110 2.1149 2.2227 2.1449 2.1615 2.2455 2.2534 2.1475 2.2331 2.2445 2.2475 2.2240 2.1772 2.2968 2.3009 2.2454 2.2275 2.2593 3.7064 3.6194 2.9882 2.1048 2.3522 3.8385 1.0218 1.0621 1.0571 0.9876 0.9875 1.0340 1.0231 1.0173 1.0044 1.0081 1.0003 1.0188 1.0075 1.0210 1.0408 0.9999 0.9989 1.0324 1.0097 0.9893 1.0247 1.0174 1.0414 1.0006 1.0331 1.0184 1.0015 1.0214 1.0003 1.0108 1.0338 1.0025
dispcorr: -0.267437093 hartree
dipole: -6.60865 2.26482 -4.34383 2.42856 -3.74611 -1.31755 12.82722 -9.89186 2.93536
magnitude: 5.40566 au
magnitude: 13.74009 debye
