program: Orca
programVersion: 5.0.2
elementType: Si Si Si Si Si Si Si Si Si Si Si Si Si Si Si Si Si Si Si Si Si Si Si Si Si Si O O O O O O O O O O O O O O O O O O O O O O O O O O O O O O O O O O O O O O O O O O O O O O O O O O O O O O O O O O O O O O O O O O O O O O Al Al Co Ga H H H H H H H H H H H H H H H H H H H H H H H H H H H H
charge: 0
multiplicity: 3
keywords: QMMM pbe d3bj def2-svp
formula: H28Al2CoGaO70Si26
InChI: InChI=1S/2Al.Co.Ga.H28O70Si26/c;;;;1-71(2,3)37-81(23)53-87(29)43-75(11,12)39-73(7,8)41-83(25)45-77(15,16)47-85(27)59-86(28)48-78(17,18)46-84(26,58-94(36,61-86)63-93(35,57-83)60-85)42-74(9,10)40-76(13,14)44-88(30)54-82(24,38-72(4,5)6)56-90(32)50-80(21,22)52-92(34)62-91(33)51-79(19,20)49-89(31,55-81)66-95(64-87,68-91)70-96(65-88,67-90)69-92/h;;;;1-2,4-5,7,9,11-28,31-34H/q2*+3;;;-6
128 atoms
Si -1.661853 13.00687 3.492812
Si 3.12731 15.763228 6.532018
Si 5.251302 9.161003 -1.553928
Si 5.307946 14.52384 1.580149
Si 1.590273 10.544839 11.545847
Si 3.764029 11.782221 -1.620369
Si -1.477677 10.509362 8.421517
Si 3.115352 15.799204 3.467057
Si -1.496226 13.075998 6.55929
Si 5.290564 14.505264 -1.538443
Si 3.114476 7.889925 11.577757
Si -1.5499 10.513497 11.55628
Si 3.09168 7.877573 8.456511
Si 5.316663 9.261592 1.591658
Si 5.261395 6.641189 6.565344
Si 1.587193 10.490681 8.410302
Si 3.87215 11.867105 1.486601
Si 1.628418 12.993651 6.506792
Si 1.541974 5.22677 8.43737
Si 8.413817 6.61494 6.537888
Si 3.621115 3.859441 3.501995
Si 8.376847 9.132057 -1.518942
Si 1.514946 5.190933 11.571805
Si 3.734119 3.916759 6.580436
Si 8.393746 6.612972 3.478791
Si 8.361388 9.151902 1.607084
O  -2.428666 11.552375 12.400714
O  2.472844 6.454032 11.935497
O  0.027477 10.70896 11.914109
O  4.817786 7.327233 5.145412
O  6.834573 14.837347 2.099914
O  -2.458623 9.311492 7.908404
O  2.650437 17.268584 2.927574
O  4.368257 13.251725 -1.959087
O  4.851272 10.660262 -2.042412
O  6.824436 8.942711 -1.915263
O  4.387005 8.058537 -2.365065
O  4.492817 8.070799 12.403194
O  3.637515 15.96027 5.002687
O  -2.548469 11.904993 2.728734
O  4.396537 15.447313 2.499141
O  1.933677 16.821845 6.90144
O  5.198747 14.956671 0.013789
O  -1.80455 11.813197 7.545611
O  2.44143 11.643592 12.37608
O  -1.983372 14.559968 3.093317
O  6.820805 14.020124 -1.931164
O  -1.992839 12.726837 5.078124
O  4.452184 15.948312 7.431523
O  4.806589 15.783315 -2.383949
O  2.037674 9.036299 11.949369
O  -1.880561 8.945938 11.907804
O  -2.368645 14.318717 7.139408
O  4.97747 8.984557 0.029696
O  1.912597 6.809618 8.231436
O  6.858402 6.211384 3.458724
O  4.447263 7.623653 7.602873
O  2.532546 14.291558 6.86598
O  6.833516 6.801203 6.882094
O  4.868742 5.096954 6.707061
O  4.397549 10.481098 2.193761
O  2.007338 12.384963 5.050707
O  2.562143 9.300145 7.805011
O  0.065684 9.99282 8.231191
O  4.204437 5.318871 3.249266
O  6.864414 9.747966 1.734979
O  1.964372 14.709076 3.394255
O  3.518048 7.993882 9.994536
O  0.091638 13.451981 6.630753
O  1.985319 11.808976 7.57431
O  3.422873 11.671751 -0.042735
O  1.897761 10.790127 9.961376
O  -0.109229 12.802375 3.195797
O  4.934764 8.014407 2.487571
O  5.087943 12.921525 1.660724
O  8.832454 6.965989 5.015393
O  1.98611 3.910387 12.406357
O  0.01815 5.001426 7.91244
O  9.400131 5.447244 2.933838
O  8.724749 10.701203 -1.915691
O  9.215531 7.673947 7.447795
O  -0.0062 5.687911 11.919589
O  8.726252 5.054116 6.912862
O  2.229595 3.636238 2.729855
O  3.206938 3.692059 5.090656
O  4.810411 2.807697 3.106591
O  9.259966 8.088706 -2.36926
O  8.6962 8.840421 0.041476
O  1.642866 4.809412 9.992042
O  4.363349 2.539062 7.160155
O  9.407759 10.316642 2.114547
O  2.485986 4.271082 7.561895
O  8.738898 7.892776 2.51263
O  2.572262 12.198753 2.351969
O  2.378929 11.601172 -2.429141
O  -1.804388 10.813827 9.975916
Al 5.202555 6.658966 3.522348
Al 1.536027 13.051086 3.457305
Co 3.1534 10.927195 4.053813
Ga 3.600132 9.165209 5.477626
H  -3.168043 11.692741 13.035317
H  7.717916 14.633038 1.772685
H  -2.829948 8.475392 8.24361
H  2.014541 17.932448 3.245327
H  3.645365 7.948707 -3.00747
H  4.934673 8.672443 13.036365
H  -3.218702 11.844979 2.038582
H  1.714171 17.74198 6.695144
H  3.17344 11.731312 13.0249
H  -2.628988 15.234299 3.315412
H  7.709382 14.289045 -1.701329
H  4.917491 16.54304 8.041961
H  5.070064 16.471707 -3.015455
H  -2.585514 8.323945 11.704224
H  -2.791901 15.13542 6.795768
H  1.73363 3.204754 13.037703
H  -0.88884 5.104767 8.245317
H  9.696566 4.571596 3.247976
H  9.41098 11.332822 -1.694787
H  9.969271 7.782955 8.048842
H  -0.896424 5.393478 11.709207
H  9.411616 4.408496 6.699974
H  1.8393 3.087266 2.039056
H  5.068968 1.907351 3.321024
H  9.98806 7.961464 -3.009244
H  4.88264 1.792195 6.804542
H  9.699791 11.173344 1.778873
H  1.902446 10.994829 -3.034565
exchangeener: -1285.148604769547 hartree
correlationener: -38.159735392880 hartree
xcener: -1323.308340162427 hartree
s2: 2.038715
chargesum: 0.0000000
charge: 0.792869 0.779619 0.834791 0.798371 0.835863 0.830814 0.815764 0.824195 0.811175 0.772431 0.833116 0.802876 0.896613 0.880661 0.946571 0.898935 0.905021 0.940730 0.810966 0.774933 0.789957 0.783519 0.796855 0.805785 0.822759 0.798521 -0.308654 -0.423563 -0.426396 -0.606647 -0.316750 -0.318291 -0.325353 -0.420626 -0.464086 -0.424910 -0.319352 -0.314082 -0.460029 -0.305086 -0.407017 -0.369280 -0.446643 -0.409144 -0.319540 -0.373828 -0.369003 -0.444690 -0.321190 -0.303460 -0.460702 -0.363510 -0.322588 -0.452456 -0.473885 -0.508826 -0.460029 -0.424487 -0.416236 -0.451967 -0.504034 -0.605434 -0.510702 -0.477165 -0.477052 -0.479616 -0.503874 -0.436310 -0.463863 -0.423738 -0.431530 -0.447982 -0.474205 -0.479979 -0.467300 -0.457788 -0.303621 -0.311319 -0.331419 -0.373802 -0.318512 -0.360030 -0.365344 -0.305857 -0.445514 -0.375243 -0.311665 -0.449699 -0.445378 -0.313203 -0.323889 -0.403959 -0.408342 -0.504846 -0.308267 -0.447690 0.767072 0.804798 0.342627 0.423235 0.212535 0.123519 0.147284 0.163161 0.187695 0.179013 0.190022 0.164330 0.180322 0.155283 0.115517 0.189481 0.188628 0.136992 0.176860 0.210081 0.148031 0.164409 0.115364 0.190311 0.137685 0.163298 0.190753 0.155692 0.192516 0.174552 0.120871 0.184831
charge: 0.421298 0.436172 0.463287 0.448922 0.465369 0.455062 0.462536 0.444944 0.464177 0.432944 0.461282 0.449365 0.468917 0.461298 0.496751 0.481449 0.450454 0.494236 0.457323 0.433786 0.421964 0.437683 0.446256 0.460694 0.448974 0.453917 -0.160445 -0.237204 -0.239558 -0.229403 -0.186477 -0.181766 -0.185503 -0.234613 -0.255894 -0.238627 -0.177090 -0.172339 -0.262592 -0.158510 -0.227777 -0.198260 -0.255072 -0.231406 -0.176745 -0.194515 -0.205988 -0.251548 -0.173325 -0.160388 -0.252584 -0.196732 -0.180969 -0.241831 -0.251512 -0.269521 -0.233137 -0.239932 -0.235430 -0.241057 -0.229084 -0.255590 -0.233577 -0.257763 -0.257806 -0.258911 -0.266682 -0.238694 -0.244662 -0.242685 -0.227859 -0.244916 -0.254063 -0.258458 -0.250059 -0.262588 -0.155605 -0.175297 -0.189374 -0.211016 -0.170706 -0.193155 -0.194522 -0.158823 -0.252129 -0.196353 -0.167716 -0.257319 -0.252127 -0.173488 -0.192759 -0.227587 -0.230707 -0.222661 -0.168146 -0.254428 0.207967 0.182971 0.334286 0.343775 0.127808 0.057535 0.078888 0.084940 0.111204 0.102150 0.101576 0.082131 0.104172 0.073135 0.046272 0.105010 0.106137 0.062673 0.099560 0.124479 0.078791 0.087792 0.046645 0.105276 0.063054 0.080313 0.102662 0.073866 0.111515 0.096076 0.056104 0.107247
qa: 0.7929 0.7796 0.8348 0.7984 0.8359 0.8308 0.8158 0.8242 0.8112 0.7724 0.8331 0.8029 0.8966 0.8807 0.9466 0.8989 0.9050 0.9407 0.8110 0.7749 0.7900 0.7835 0.7969 0.8058 0.8228 0.7985 -0.3087 -0.4236 -0.4264 -0.6066 -0.3167 -0.3183 -0.3254 -0.4206 -0.4641 -0.4249 -0.3194 -0.3141 -0.4600 -0.3051 -0.4070 -0.3693 -0.4466 -0.4091 -0.3195 -0.3738 -0.3690 -0.4447 -0.3212 -0.3035 -0.4607 -0.3635 -0.3226 -0.4525 -0.4739 -0.5088 -0.4600 -0.4245 -0.4162 -0.4520 -0.5040 -0.6054 -0.5107 -0.4772 -0.4771 -0.4796 -0.5039 -0.4363 -0.4639 -0.4237 -0.4315 -0.4480 -0.4742 -0.4800 -0.4673 -0.4578 -0.3036 -0.3113 -0.3314 -0.3738 -0.3185 -0.3600 -0.3653 -0.3059 -0.4455 -0.3752 -0.3117 -0.4497 -0.4454 -0.3132 -0.3239 -0.4040 -0.4083 -0.5048 -0.3083 -0.4477 0.7671 0.8048 0.3426 0.4232 0.2125 0.1235 0.1473 0.1632 0.1877 0.1790 0.1900 0.1643 0.1803 0.1553 0.1155 0.1895 0.1886 0.1370 0.1769 0.2101 0.1480 0.1644 0.1154 0.1903 0.1377 0.1633 0.1908 0.1557 0.1925 0.1746 0.1209 0.1848
va: 4.7874 4.8133 4.7674 4.7965 4.7644 4.7734 4.7766 4.7660 4.7837 4.8145 4.7671 4.7792 4.6985 4.7125 4.6112 4.6972 4.6813 4.6356 4.7823 4.8178 4.7930 4.8014 4.7866 4.7899 4.7671 4.7961 2.2518 2.2777 2.2745 2.1425 2.1815 2.1984 2.2103 2.2797 2.2560 2.2751 2.2279 2.2299 2.2362 2.2497 2.2996 2.1595 2.2468 2.2959 2.2230 2.1462 2.1174 2.2551 2.2197 2.2384 2.2578 2.1463 2.2199 2.2732 2.2572 2.2544 2.2635 2.2821 2.2919 2.2754 2.2397 2.1786 2.2202 2.2520 2.2815 2.2454 2.2636 2.2881 2.2639 2.2970 2.2985 2.2744 2.2895 2.2788 2.2620 2.2376 2.2576 2.2095 2.2013 2.1108 2.2246 2.1515 2.1643 2.2481 2.2549 2.1441 2.2293 2.2440 2.2511 2.2315 2.1677 2.3013 2.2964 2.2605 2.2415 2.2483 3.7240 3.6552 4.1431 2.1031 0.9874 1.0335 1.0229 1.0159 1.0019 1.0070 1.0011 1.0162 1.0060 1.0214 1.0411 1.0007 1.0012 1.0318 1.0084 0.9892 1.0229 1.0147 1.0408 1.0004 1.0317 1.0171 1.0005 1.0210 0.9984 1.0102 1.0341 1.0040
dispcorr: -0.255113606 hartree
dipole: -0.29988 -2.68990 -2.98978 -0.45632 -1.40093 -1.85725 3.82625 -0.34151 3.48474
magnitude: 4.95294 au
magnitude: 12.58936 debye
