program: Orca
programVersion: 5.0.2
elementType: Si Si Si Si Si Si Si Si Si Si Si Si Si Si Si Si Si Si Si Si Si Si Si Si Si Si O O O O O O O O O O O O O O O O O O O O O O O O O O O O O O O O O O O O O O O O O O O O O O O O O O O O O O O O O O O O O O O O O O O O O O Al Al Co Ga H H H H H H H H H H H H H H H H H H H H H H H H H H H H
charge: 0
multiplicity: 1
keywords: QMMM pbe d3bj def2-svp
formula: H28Al2CoGaO70Si26
InChI: InChI=1S/2Al.Co.Ga.H28O70Si26/c;;;;1-71(2,3)37-81(23)53-87(29)43-75(11,12)39-73(7,8)41-83(25)45-77(15,16)47-85(27)59-86(28)48-78(17,18)46-84(26,58-94(36,61-86)63-93(35,57-83)60-85)42-74(9,10)40-76(13,14)44-88(30)54-82(24,38-72(4,5)6)56-90(32)50-80(21,22)52-92(34)62-91(33)51-79(19,20)49-89(31,55-81)66-95(64-87,68-91)70-96(65-88,67-90)69-92/h;;;;1-2,4-5,7,9,11-28,31-34H/q+2;+4;;;-6
128 atoms
Si -1.664067 13.008829 3.491585
Si 3.128861 15.758487 6.526778
Si 5.247355 9.160596 -1.544408
Si 5.312141 14.523085 1.579135
Si 1.590672 10.543986 11.548515
Si 3.758828 11.783876 -1.615213
Si -1.465833 10.507076 8.416666
Si 3.119514 15.800848 3.474728
Si -1.481347 13.069978 6.547963
Si 5.290166 14.505264 -1.539038
Si 3.102569 7.893474 11.588413
Si -1.549417 10.516688 11.5517
Si 3.095109 7.873437 8.459651
Si 5.305786 9.252002 1.605045
Si 5.24983 6.660477 6.556876
Si 1.604878 10.48048 8.408781
Si 3.886422 11.865945 1.48871
Si 1.654102 12.957552 6.483582
Si 1.545021 5.233666 8.436487
Si 8.413372 6.616979 6.536824
Si 3.617777 3.859041 3.511984
Si 8.374535 9.134458 -1.514312
Si 1.514749 5.191255 11.571012
Si 3.736282 3.923281 6.570562
Si 8.383892 6.617814 3.493152
Si 8.352008 9.151857 1.613949
O  -2.434101 11.554873 12.392281
O  2.467212 6.454915 11.945995
O  0.026521 10.719377 11.909284
O  4.77967 7.396939 5.171838
O  6.835979 14.844414 2.098677
O  -2.447102 9.308109 7.906737
O  2.643019 17.262225 2.925109
O  4.363795 13.252673 -1.954902
O  4.846232 10.662002 -2.030254
O  6.820235 8.945905 -1.907011
O  4.383864 8.061825 -2.360701
O  4.483196 8.071317 12.411081
O  3.653733 15.97516 5.003376
O  -2.538845 11.906445 2.717024
O  4.388786 15.435717 2.496288
O  1.930756 16.814632 6.891384
O  5.196437 14.955132 0.01369
O  -1.791304 11.813294 7.540302
O  2.442547 11.64767 12.372841
O  -1.983418 14.561615 3.090343
O  6.819931 14.019532 -1.929474
O  -2.002628 12.724881 5.073324
O  4.441303 15.941396 7.443697
O  4.806276 15.783043 -2.384324
O  2.026159 9.039343 11.972495
O  -1.881902 8.949804 11.903863
O  -2.325786 14.332234 7.129311
O  4.967194 8.99169 0.038766
O  1.901341 6.819765 8.235873
O  6.840073 6.251399 3.503041
O  4.47647 7.560447 7.68476
O  2.542682 14.274348 6.821161
O  6.83062 6.805742 6.850149
O  4.867365 5.106536 6.643063
O  4.384847 10.476397 2.209577
O  2.033738 12.314413 5.034854
O  2.584022 9.298492 7.792993
O  0.079288 9.99538 8.223172
O  4.205791 5.323261 3.295574
O  6.851822 9.744146 1.742846
O  1.969766 14.706201 3.427489
O  3.48638 8.015959 10.006344
O  0.115129 13.416281 6.583284
O  2.011309 11.803637 7.5796
O  3.415346 11.683035 -0.034313
O  1.90558 10.777111 9.96182
O  -0.107924 12.812117 3.202513
O  4.909647 8.007957 2.492499
O  5.104671 12.917241 1.654815
O  8.85697 6.968522 5.018632
O  1.984934 3.908197 12.403592
O  0.020256 4.99977 7.914224
O  9.36327 5.436017 2.932298
O  8.72064 10.704006 -1.912256
O  9.208057 7.673984 7.45654
O  -0.006929 5.687337 11.919866
O  8.72704 5.055809 6.912354
O  2.238972 3.652748 2.712771
O  3.185447 3.666908 5.092041
O  4.806881 2.808862 3.10917
O  9.258818 8.094409 -2.368092
O  8.688685 8.844957 0.046651
O  1.64571 4.813383 9.991581
O  4.377903 2.552811 7.157333
O  9.393373 10.322592 2.11905
O  2.497761 4.285497 7.562579
O  8.730912 7.890826 2.513786
O  2.597711 12.203143 2.384041
O  2.37156 11.599378 -2.419501
O  -1.797749 10.814993 9.969041
Al 5.178244 6.681717 3.567984
Al 1.53296 13.054081 3.475259
Co 3.166559 11.048427 3.934252
Ga 3.574968 9.321401 5.425276
H  -3.170341 11.693797 13.031751
H  7.718511 14.636026 1.772162
H  -2.825076 8.473961 8.242905
H  2.011404 17.929759 3.244285
H  3.644037 7.950097 -3.005625
H  4.930605 8.672662 13.0397
H  -3.214633 11.845593 2.03363
H  1.712936 17.73893 6.690892
H  3.173913 11.733036 13.023531
H  -2.629007 15.234996 3.314154
H  7.709012 14.288794 -1.700614
H  4.91289 16.540116 8.047109
H  5.069932 16.471592 -3.015614
H  -2.586081 8.32558 11.702557
H  -2.773778 15.141136 6.791499
H  1.733133 3.203828 13.036533
H  -0.88795 5.104067 8.246071
H  9.68098 4.566849 3.247325
H  9.409243 11.334007 -1.693334
H  9.96611 7.782971 8.052539
H  -0.896732 5.393235 11.709324
H  9.411949 4.409212 6.699759
H  1.843265 3.094247 2.031832
H  5.067475 1.907844 3.322115
H  9.987575 7.963875 -3.00875
H  4.888794 1.798008 6.803348
H  9.693708 11.17586 1.780777
H  1.899331 10.994071 -3.030488
exchangeener: -1285.067516368948 hartree
correlationener: -38.165162224858 hartree
xcener: -1323.232678593806 hartree
chargesum: -0.0000000
charge: 0.793019 0.784170 0.835861 0.799807 0.835900 0.834081 0.818574 0.827083 0.815590 0.772877 0.830668 0.803989 0.885751 0.892660 0.938020 0.901843 0.941956 0.953460 0.812715 0.775324 0.790705 0.784962 0.796410 0.805808 0.822313 0.801138 -0.309883 -0.423193 -0.426433 -0.605174 -0.314786 -0.319397 -0.324133 -0.420792 -0.463794 -0.425282 -0.319098 -0.314137 -0.459732 -0.302546 -0.407119 -0.371257 -0.445911 -0.410177 -0.320634 -0.373120 -0.368531 -0.443865 -0.320545 -0.302860 -0.460297 -0.363579 -0.325419 -0.452555 -0.474791 -0.508205 -0.440956 -0.424982 -0.415578 -0.453908 -0.497383 -0.590335 -0.513818 -0.476819 -0.475975 -0.481007 -0.502255 -0.435022 -0.463574 -0.423046 -0.430969 -0.447445 -0.471631 -0.473882 -0.464196 -0.458731 -0.304359 -0.313244 -0.333393 -0.374213 -0.319563 -0.360466 -0.366149 -0.306543 -0.446269 -0.376672 -0.312765 -0.449739 -0.445743 -0.315890 -0.324581 -0.404871 -0.408723 -0.499764 -0.308057 -0.447972 0.761422 0.827234 0.184076 0.438605 0.212772 0.124800 0.148734 0.164440 0.188612 0.177815 0.190030 0.166337 0.180602 0.155580 0.116550 0.190870 0.189263 0.137440 0.179104 0.209475 0.147682 0.165264 0.115411 0.189682 0.136661 0.162635 0.190364 0.155845 0.193755 0.174554 0.120846 0.186598
charge: 0.421800 0.439265 0.464544 0.449615 0.465904 0.456886 0.464806 0.446997 0.467111 0.432936 0.459483 0.449995 0.465319 0.467357 0.490880 0.484603 0.463502 0.502746 0.458430 0.434097 0.422203 0.438327 0.445740 0.461460 0.449437 0.455858 -0.161562 -0.236863 -0.239770 -0.234937 -0.184345 -0.182429 -0.184592 -0.234678 -0.255397 -0.238814 -0.176625 -0.172431 -0.262492 -0.156225 -0.227334 -0.200115 -0.254797 -0.232097 -0.177814 -0.193926 -0.205258 -0.250953 -0.172627 -0.159731 -0.252789 -0.196776 -0.183039 -0.241698 -0.252901 -0.269207 -0.235678 -0.240109 -0.235121 -0.240853 -0.204559 -0.225432 -0.232609 -0.257553 -0.257617 -0.258948 -0.264598 -0.238195 -0.243393 -0.240240 -0.225688 -0.244724 -0.251540 -0.254503 -0.247777 -0.263912 -0.156424 -0.177203 -0.190820 -0.211558 -0.171671 -0.193588 -0.195512 -0.159703 -0.253370 -0.198008 -0.168642 -0.257549 -0.252279 -0.175991 -0.193290 -0.228003 -0.231269 -0.182581 -0.167790 -0.254851 0.210207 0.194104 0.164188 0.355604 0.128091 0.058437 0.080348 0.085991 0.112159 0.101231 0.101489 0.084284 0.104334 0.073156 0.047160 0.106597 0.106602 0.063230 0.102158 0.124001 0.078793 0.088957 0.046646 0.104838 0.062168 0.079975 0.102766 0.074191 0.112947 0.096396 0.056400 0.108624
qa: 0.7930 0.7842 0.8359 0.7998 0.8359 0.8341 0.8186 0.8271 0.8156 0.7729 0.8307 0.8040 0.8858 0.8927 0.9380 0.9018 0.9420 0.9535 0.8127 0.7753 0.7907 0.7850 0.7964 0.8058 0.8223 0.8011 -0.3099 -0.4232 -0.4264 -0.6052 -0.3148 -0.3194 -0.3241 -0.4208 -0.4638 -0.4253 -0.3191 -0.3141 -0.4597 -0.3025 -0.4071 -0.3713 -0.4459 -0.4102 -0.3206 -0.3731 -0.3685 -0.4439 -0.3205 -0.3029 -0.4603 -0.3636 -0.3254 -0.4526 -0.4748 -0.5082 -0.4410 -0.4250 -0.4156 -0.4539 -0.4974 -0.5903 -0.5138 -0.4768 -0.4760 -0.4810 -0.5023 -0.4350 -0.4636 -0.4230 -0.4310 -0.4474 -0.4716 -0.4739 -0.4642 -0.4587 -0.3044 -0.3132 -0.3334 -0.3742 -0.3196 -0.3605 -0.3661 -0.3065 -0.4463 -0.3767 -0.3128 -0.4497 -0.4457 -0.3159 -0.3246 -0.4049 -0.4087 -0.4998 -0.3081 -0.4480 0.7614 0.8272 0.1841 0.4386 0.2128 0.1248 0.1487 0.1644 0.1886 0.1778 0.1900 0.1663 0.1806 0.1556 0.1166 0.1909 0.1893 0.1374 0.1791 0.2095 0.1477 0.1653 0.1154 0.1897 0.1367 0.1626 0.1904 0.1558 0.1938 0.1746 0.1208 0.1866
va: 4.7882 4.8081 4.7661 4.7951 4.7645 4.7697 4.7729 4.7644 4.7786 4.8144 4.7709 4.7779 4.7147 4.6963 4.6215 4.6934 4.6380 4.6229 4.7805 4.8176 4.7933 4.7996 4.7871 4.7907 4.7678 4.7928 2.2504 2.2781 2.2743 2.1494 2.1859 2.1982 2.2133 2.2800 2.2566 2.2748 2.2289 2.2290 2.2377 2.2532 2.3000 2.1584 2.2476 2.2953 2.2222 2.1478 2.1191 2.2566 2.2218 2.2399 2.2582 2.1463 2.2179 2.2740 2.2560 2.2542 2.2814 2.2823 2.2903 2.2735 2.2550 2.1987 2.2216 2.2526 2.2824 2.2453 2.2678 2.2869 2.2651 2.2991 2.3032 2.2755 2.2948 2.2848 2.2670 2.2370 2.2561 2.2064 2.1991 2.1104 2.2229 2.1501 2.1625 2.2466 2.2546 2.1424 2.2286 2.2439 2.2506 2.2279 2.1666 2.3006 2.2964 2.2788 2.2435 2.2480 3.7307 3.6237 2.8957 2.1666 0.9872 1.0332 1.0222 1.0155 1.0014 1.0077 1.0012 1.0151 1.0059 1.0214 1.0408 0.9999 1.0009 1.0315 1.0071 0.9895 1.0229 1.0142 1.0408 1.0007 1.0322 1.0174 1.0006 1.0209 0.9977 1.0102 1.0341 1.0031
dispcorr: -0.256317835 hartree
dipole: -0.16060 -2.93647 -3.09707 -2.25895 1.04285 -1.21610 4.72842 -1.74793 2.98049
magnitude: 4.46699 au
magnitude: 11.35419 debye
