program: Orca
programVersion: 5.0.2
elementType: Si Si Si Si Si Si Si Si Si Si Si Si Si Si Si Si Si Si Si Si Si Si Si Si Si Si O O O O O O O O O O O O O O O O O O O O O O O O O O O O O O O O O O O O O O O O O O O O O O O O O O O O O O O O O O O O O O O O O O O O O O Al Al Co Cu O C H H H H H H H H H H H H H H H H H H H H H H H H H H H H H H H H
charge: 0
multiplicity: 3
keywords: QMMM pbe d3bj def2-svp
formula: CH32Al2CoCuO71Si26
InChI: InChI=1S/CH4O.2Al.Co.Cu.H28O70Si26/c1-2;;;;;1-71(2,3)37-81(23)53-87(29)43-75(11,12)39-73(7,8)41-83(25)45-77(15,16)47-85(27)59-86(28)48-78(17,18)46-84(26,58-94(36,61-86)63-93(35,57-83)60-85)42-74(9,10)40-76(13,14)44-88(30)54-82(24,38-72(4,5)6)56-90(32)50-80(21,22)52-92(34)62-91(33)51-79(19,20)49-89(31,55-81)66-95(64-87,68-91)70-96(65-88,67-90)69-92/h2H,1H3;;;;;1-2,4-5,7,9,11-28,31-34H/q;+2;+3;;;-5
134 atoms
Si -1.666078 13.007611 3.478237
Si 3.123164 15.764308 6.526768
Si 5.253314 9.146496 -1.564431
Si 5.313066 14.514208 1.582391
Si 1.576471 10.558449 11.56987
Si 3.743941 11.787217 -1.590071
Si -1.494389 10.516473 8.431435
Si 3.112544 15.811624 3.455674
Si -1.511966 13.079446 6.566197
Si 5.292109 14.498843 -1.539037
Si 3.119121 7.881361 11.572781
Si -1.557855 10.51508 11.565911
Si 3.094749 7.867171 8.461179
Si 5.326892 9.23802 1.557917
Si 5.292917 6.603551 6.586541
Si 1.565405 10.535862 8.460199
Si 3.888317 11.860316 1.514063
Si 1.592958 13.011548 6.511956
Si 1.541528 5.238342 8.435283
Si 8.401195 6.61134 6.547887
Si 3.62692 3.863076 3.49044
Si 8.380758 9.135992 -1.527205
Si 1.513322 5.191452 11.570335
Si 3.759866 3.928238 6.597617
Si 8.411491 6.586939 3.443361
Si 8.381336 9.141924 1.603355
O  -2.439167 11.562664 12.396271
O  2.459271 6.456424 11.952156
O  0.011404 10.701836 11.944914
O  4.993867 7.112505 5.092097
O  6.836374 14.843906 2.096892
O  -2.447489 9.301371 7.901392
O  2.669045 17.290153 2.921042
O  4.365885 13.243421 -1.952602
O  4.829832 10.652858 -1.993484
O  6.826657 8.951742 -1.924537
O  4.394685 8.048561 -2.382063
O  4.487503 8.068761 12.413789
O  3.6261 15.955794 4.992254
O  -2.568916 11.894334 2.746525
O  4.389345 15.434064 2.490204
O  1.927694 16.821349 6.89486
O  5.197643 14.941919 0.014084
O  -1.828668 11.803276 7.530737
O  2.419979 11.650477 12.413214
O  -1.993147 14.558603 3.082076
O  6.822306 14.010796 -1.929643
O  -1.953153 12.72193 5.067537
O  4.449243 15.957276 7.421745
O  4.810527 15.774391 -2.38919
O  2.04501 9.046215 11.912066
O  -1.888572 8.948153 11.915203
O  -2.423065 14.297045 7.13568
O  4.982287 8.903532 0.015165
O  1.884719 6.822006 8.226212
O  6.898157 6.141412 3.255298
O  4.385076 7.561093 7.551398
O  2.522095 14.296447 6.853457
O  6.853878 6.803207 6.97644
O  4.928065 5.045729 6.792702
O  4.36486 10.423548 2.138338
O  1.885907 12.417343 5.032303
O  2.525251 9.313831 7.935918
O  0.050137 10.022017 8.225533
O  4.185199 5.312041 3.120021
O  6.865183 9.709879 1.729829
O  1.937282 14.746541 3.353586
O  3.543908 7.934542 10.001024
O  0.062402 13.488429 6.67787
O  1.952361 11.811119 7.556004
O  3.392095 11.707563 -0.01179
O  1.843595 10.898584 9.998447
O  -0.127432 12.808352 3.108435
O  4.89603 8.00532 2.488494
O  5.112647 12.90509 1.663067
O  8.746765 6.938807 4.994607
O  1.982867 3.905344 12.399964
O  0.01513 5.016847 7.901597
O  9.478255 5.462619 2.927459
O  8.724097 10.705162 -1.921117
O  9.267564 7.684355 7.383302
O  -0.008697 5.689083 11.92084
O  8.731021 5.051728 6.915036
O  2.21321 3.614702 2.758619
O  3.251958 3.77077 5.08431
O  4.81187 2.806074 3.098813
O  9.256713 8.089189 -2.377394
O  8.698849 8.845188 0.032523
O  1.639288 4.813755 9.99047
O  4.30804 2.502494 7.147945
O  9.401249 10.322251 2.114111
O  2.480237 4.296578 7.537721
O  8.76952 7.89201 2.506003
O  2.631668 12.186112 2.449017
O  2.362802 11.591185 -2.402844
O  -1.818617 10.815646 9.985044
Al 5.255215 6.58217 3.441294
Al 1.499707 13.097618 3.432005
Co 2.717112 10.902803 4.006028
Cu 3.754692 8.5649 4.027875
O  2.444259 9.378364 5.289077
C  1.165601 8.71596 5.186058
H  1.265317 7.673558 5.498059
H  2.649499 9.406427 6.259873
H  0.433109 9.213697 5.825204
H  0.838671 8.772245 4.149182
H  -3.172483 11.697091 13.033438
H  7.718677 14.635811 1.771407
H  -2.82524 8.471112 8.240645
H  2.022409 17.941569 3.242565
H  3.648612 7.944489 -3.014657
H  4.932426 8.671582 13.040845
H  -3.227348 11.840472 2.046105
H  1.711641 17.74177 6.692361
H  3.16437 11.734223 13.040602
H  -2.633121 15.233722 3.310658
H  7.710016 14.2851 -1.700686
H  4.916248 16.546831 8.037826
H  5.071729 16.467934 -3.017671
H  -2.588901 8.324882 11.707353
H  -2.814912 15.126256 6.794192
H  1.732259 3.202621 13.034999
H  -0.890118 5.111288 8.240732
H  9.729601 4.578098 3.245278
H  9.410705 11.334496 -1.697081
H  9.991273 7.787356 8.021571
H  -0.89748 5.393973 11.709736
H  9.413632 4.407486 6.700893
H  1.832372 3.078159 2.051219
H  5.069585 1.906665 3.317736
H  9.986684 7.961668 -3.012683
H  4.859253 1.776732 6.799378
H  9.697039 11.175716 1.778689
H  1.895627 10.990606 -3.023445
exchangeener: -1292.338660094600 hartree
correlationener: -38.669782938730 hartree
xcener: -1331.008443033331 hartree
s2: 2.018401
chargesum: -0.0000000
charge: 0.790377 0.781901 0.835535 0.798174 0.831324 0.835063 0.823766 0.825285 0.804378 0.774295 0.831161 0.797626 0.875429 0.928000 0.915385 0.881102 0.909178 0.945483 0.813269 0.774425 0.794385 0.780148 0.796082 0.801227 0.823064 0.799295 -0.305740 -0.424744 -0.424991 -0.568439 -0.314809 -0.325423 -0.325807 -0.422671 -0.466197 -0.424068 -0.313804 -0.313010 -0.459148 -0.307143 -0.406007 -0.369748 -0.447819 -0.412588 -0.313264 -0.369143 -0.369876 -0.446448 -0.320936 -0.304131 -0.463184 -0.360522 -0.318166 -0.446181 -0.488398 -0.501691 -0.425818 -0.423493 -0.421164 -0.464887 -0.475025 -0.605725 -0.526517 -0.493776 -0.484731 -0.469685 -0.502460 -0.439645 -0.464638 -0.423599 -0.439986 -0.436678 -0.476790 -0.527492 -0.467450 -0.457526 -0.304856 -0.320543 -0.328051 -0.371230 -0.320770 -0.360703 -0.365150 -0.311909 -0.448628 -0.372284 -0.308608 -0.449135 -0.444239 -0.315087 -0.317245 -0.409641 -0.406978 -0.527870 -0.310681 -0.441560 0.812864 0.821230 0.275444 0.269187 -0.358210 0.071306 0.081528 0.268044 0.076034 0.084134 0.210225 0.122747 0.146919 0.162808 0.186320 0.176958 0.188839 0.163089 0.177210 0.154177 0.115591 0.190670 0.189430 0.136065 0.174919 0.209327 0.144551 0.162328 0.116201 0.188820 0.135597 0.159464 0.189854 0.155878 0.192658 0.171822 0.121696 0.185260
charge: 0.417256 0.437420 0.461374 0.451456 0.461539 0.457498 0.456201 0.448045 0.458707 0.433534 0.461130 0.446790 0.461212 0.477219 0.477372 0.463940 0.460042 0.489229 0.453555 0.432572 0.419084 0.436570 0.445747 0.456023 0.446143 0.453411 -0.157672 -0.237972 -0.238199 -0.251906 -0.184721 -0.183714 -0.186015 -0.236260 -0.256073 -0.237683 -0.172248 -0.171367 -0.261516 -0.160539 -0.227575 -0.197986 -0.255413 -0.232408 -0.171639 -0.190888 -0.206856 -0.251341 -0.173027 -0.160786 -0.252939 -0.194089 -0.176998 -0.238101 -0.260351 -0.266442 -0.246998 -0.239152 -0.237664 -0.248187 -0.242894 -0.246626 -0.250891 -0.259785 -0.258777 -0.250854 -0.266029 -0.239143 -0.247381 -0.244903 -0.233991 -0.238394 -0.254576 -0.204669 -0.250974 -0.259375 -0.156894 -0.181917 -0.186696 -0.208677 -0.172922 -0.194272 -0.194042 -0.164741 -0.252255 -0.194569 -0.164462 -0.256279 -0.252428 -0.174796 -0.186395 -0.231018 -0.230017 -0.216423 -0.169738 -0.252586 0.157055 0.173389 0.261754 0.243688 0.058582 0.071578 0.034359 0.075170 0.032292 0.040219 0.124766 0.056821 0.078037 0.084285 0.109218 0.100436 0.099672 0.080781 0.100594 0.072018 0.046361 0.106521 0.107244 0.061628 0.097128 0.123820 0.075621 0.084330 0.047024 0.104172 0.061129 0.076988 0.101751 0.074146 0.111167 0.093585 0.056699 0.108016
qa: 0.7904 0.7819 0.8355 0.7982 0.8313 0.8351 0.8238 0.8253 0.8044 0.7743 0.8312 0.7976 0.8754 0.9280 0.9154 0.8811 0.9092 0.9455 0.8133 0.7744 0.7944 0.7801 0.7961 0.8012 0.8231 0.7993 -0.3057 -0.4247 -0.4250 -0.5684 -0.3148 -0.3254 -0.3258 -0.4227 -0.4662 -0.4241 -0.3138 -0.3130 -0.4591 -0.3071 -0.4060 -0.3697 -0.4478 -0.4126 -0.3133 -0.3691 -0.3699 -0.4464 -0.3209 -0.3041 -0.4632 -0.3605 -0.3182 -0.4462 -0.4884 -0.5017 -0.4258 -0.4235 -0.4212 -0.4649 -0.4750 -0.6057 -0.5265 -0.4938 -0.4847 -0.4697 -0.5025 -0.4396 -0.4646 -0.4236 -0.4400 -0.4367 -0.4768 -0.5275 -0.4675 -0.4575 -0.3049 -0.3205 -0.3281 -0.3712 -0.3208 -0.3607 -0.3651 -0.3119 -0.4486 -0.3723 -0.3086 -0.4491 -0.4442 -0.3151 -0.3172 -0.4096 -0.4070 -0.5279 -0.3107 -0.4416 0.8129 0.8212 0.2754 0.2692 -0.3582 0.0713 0.0815 0.2680 0.0760 0.0841 0.2102 0.1227 0.1469 0.1628 0.1863 0.1770 0.1888 0.1631 0.1772 0.1542 0.1156 0.1907 0.1894 0.1361 0.1749 0.2093 0.1446 0.1623 0.1162 0.1888 0.1356 0.1595 0.1899 0.1559 0.1927 0.1718 0.1217 0.1853
va: 4.7903 4.8097 4.7660 4.7968 4.7687 4.7675 4.7678 4.7623 4.7948 4.8130 4.7692 4.7854 4.7316 4.6554 4.6746 4.7225 4.6785 4.6286 4.7817 4.8179 4.7865 4.8054 4.7877 4.7984 4.7605 4.7946 2.2548 2.2764 2.2760 2.2074 2.1829 2.1938 2.2102 2.2780 2.2539 2.2763 2.2344 2.2284 2.2370 2.2477 2.2996 2.1583 2.2458 2.2953 2.2283 2.1505 2.1166 2.2529 2.2201 2.2379 2.2552 2.1494 2.2243 2.2826 2.2407 2.2655 2.2931 2.2831 2.2869 2.2614 2.2544 2.1783 2.1963 2.2367 2.2811 2.2594 2.2662 2.2846 2.2621 2.2988 2.2895 2.2873 2.2885 2.2518 2.2609 2.2368 2.2554 2.1962 2.2062 2.1152 2.2195 2.1489 2.1615 2.2416 2.2501 2.1484 2.2340 2.2450 2.2529 2.2264 2.1772 2.2966 2.2975 2.2429 2.2378 2.2559 3.6538 3.6370 3.6067 1.7839 2.3773 3.8152 1.0115 1.0113 1.0351 1.0038 0.9890 1.0341 1.0235 1.0164 1.0029 1.0079 1.0018 1.0169 1.0078 1.0220 1.0411 0.9999 1.0007 1.0323 1.0095 0.9896 1.0244 1.0160 1.0407 1.0010 1.0326 1.0189 1.0009 1.0209 0.9986 1.0113 1.0341 1.0035
dispcorr: -0.269713053 hartree
dipole: -6.15430 2.66621 -3.48809 -2.13757 0.41372 -1.72386 15.03619 -12.26788 2.76831
magnitude: 4.77514 au
magnitude: 12.13745 debye
