program: Orca
programVersion: 5.0.2
elementType: Si Si Si Si Si Si Si Si Si Si Si Si Si Si Si Si Si Si Si Si Si Si Si Si Si Si O O O O O O O O O O O O O O O O O O O O O O O O O O O O O O O O O O O O O O O O O O O O O O O O O O O O O O O O O O O O O O O O O O O O O O Al Al Co Co H H H H H H H H H H H H H H H H H H H H H H H H H H H H
charge: 0
multiplicity: 1
keywords: QMMM pbe d3bj def2-svp
formula: H28Al2Co2O70Si26
InChI: InChI=1S/2Al.2Co.H28O70Si26/c;;;;1-71(2,3)37-81(23)53-87(29)43-75(11,12)39-73(7,8)41-83(25)45-77(15,16)47-85(27)59-86(28)48-78(17,18)46-84(26,58-94(36,61-86)63-93(35,57-83)60-85)42-74(9,10)40-76(13,14)44-88(30)54-82(24,38-72(4,5)6)56-90(32)50-80(21,22)52-92(34)62-91(33)51-79(19,20)49-89(31,55-81)66-95(64-87,68-91)70-96(65-88,67-90)69-92/h;;;;1-2,4-5,7,9,11-28,31-34H/q2*+3;;;-6
128 atoms
Si -1.653424 13.010376 3.495831
Si 3.123202 15.77021 6.532255
Si 5.267893 9.15178 -1.582843
Si 5.302246 14.538805 1.581489
Si 1.572668 10.551629 11.577003
Si 3.732059 11.793859 -1.583567
Si -1.486106 10.512291 8.435133
Si 3.12501 15.791339 3.463547
Si -1.523097 13.07112 6.570115
Si 5.290748 14.505303 -1.535401
Si 3.107674 7.879203 11.596028
Si -1.558315 10.516187 11.566734
Si 3.092177 7.880962 8.488577
Si 5.375093 9.212661 1.522003
Si 5.249654 6.649064 6.561012
Si 1.580248 10.515727 8.460648
Si 3.842209 11.843867 1.504548
Si 1.589173 13.006941 6.547812
Si 1.544673 5.239067 8.445181
Si 8.414565 6.617537 6.53181
Si 3.620438 3.861015 3.505755
Si 8.390208 9.130497 -1.534777
Si 1.514035 5.187111 11.575262
Si 3.735888 3.923814 6.573706
Si 8.40608 6.611609 3.480684
Si 8.411293 9.128535 1.583557
O  -2.439661 11.564348 12.396893
O  2.45489 6.450365 11.97129
O  0.009015 10.702981 11.954847
O  4.798266 7.340007 5.141917
O  6.833216 14.812528 2.109901
O  -2.463418 9.314462 7.91309
O  2.606439 17.23743 2.917061
O  4.363208 13.250787 -1.939906
O  4.825228 10.664831 -1.973706
O  6.84175 8.969641 -1.95498
O  4.42116 8.06346 -2.424497
O  4.476299 8.057284 12.438227
O  3.632023 15.966935 5.002126
O  -2.529007 11.915176 2.710379
O  4.41876 15.495832 2.498282
O  1.927394 16.823868 6.900702
O  5.210086 14.970505 0.014019
O  -1.828778 11.809423 7.546875
O  2.415346 11.646157 12.419632
O  -1.968926 14.567237 3.102889
O  6.820222 14.016987 -1.927773
O  -1.989789 12.722854 5.076362
O  4.44983 15.951119 7.428383
O  4.806267 15.778335 -2.38896
O  2.034369 9.040861 11.941596
O  -1.891337 8.950023 11.91837
O  -2.41289 14.303952 7.141108
O  5.027467 8.856126 -0.016004
O  1.900604 6.817686 8.251531
O  6.864267 6.225289 3.474573
O  4.434882 7.525002 7.659697
O  2.517691 14.300923 6.851487
O  6.832076 6.814956 6.837578
O  4.888828 5.086606 6.633711
O  4.476279 10.457817 2.049895
O  1.955427 12.352519 5.098105
O  2.555521 9.317081 7.948546
O  0.057858 10.022534 8.245595
O  4.204509 5.326159 3.264927
O  6.911356 9.714005 1.684871
O  2.034063 14.638775 3.383763
O  3.541125 7.933322 10.028759
O  0.058149 13.484622 6.644847
O  1.95465 11.844011 7.619812
O  3.324827 11.744435 -0.018052
O  1.846561 10.877494 10.006321
O  -0.098113 12.79607 3.207528
O  4.973793 7.995802 2.450677
O  5.008202 12.954857 1.690594
O  8.853642 6.968623 5.010572
O  1.986628 3.898759 12.399194
O  0.021476 4.997381 7.915493
O  9.392912 5.435844 2.925531
O  8.736453 10.699063 -1.927633
O  9.21217 7.672582 7.44998
O  -0.008313 5.682081 11.923811
O  8.72405 5.05532 6.904697
O  2.239261 3.657406 2.708928
O  3.190944 3.692782 5.084976
O  4.810057 2.810215 3.10989
O  9.254319 8.076846 -2.388629
O  8.740731 8.821979 0.01571
O  1.645599 4.803432 9.996732
O  4.361013 2.54241 7.150384
O  9.448372 10.29712 2.099564
O  2.497574 4.297358 7.554843
O  8.770661 7.873715 2.499086
O  2.601686 12.027278 2.494589
O  2.364848 11.605541 -2.422551
O  -1.819745 10.818875 9.986947
Al 5.207374 6.665944 3.519819
Al 1.553706 12.999987 3.483971
Co 2.983645 10.641972 4.429404
Co 3.499359 8.820029 4.904694
H  -3.172692 11.697804 13.033701
H  7.717342 14.622543 1.776908
H  -2.831975 8.476647 8.245592
H  1.995936 17.919274 3.240882
H  3.659807 7.950789 -3.032601
H  4.927688 8.666728 13.051179
H  -3.210472 11.849285 2.030821
H  1.711515 17.742836 6.694831
H  3.162411 11.732396 13.043316
H  -2.622879 15.237373 3.319459
H  7.709135 14.287718 -1.699895
H  4.916496 16.544227 8.040633
H  5.069928 16.469602 -3.017574
H  -2.590071 8.325672 11.708692
H  -2.810609 15.129177 6.796487
H  1.733849 3.199837 13.034674
H  -0.887434 5.103056 8.246608
H  9.693513 4.566776 3.244463
H  9.415929 11.331917 -1.699836
H  9.967849 7.782378 8.049766
H  -0.897318 5.391012 11.710992
H  9.410685 4.409005 6.696521
H  1.843388 3.096217 2.030207
H  5.068818 1.908416 3.32242
H  9.985672 7.956449 -3.017434
H  4.881652 1.79361 6.80041
H  9.716965 11.165089 1.772537
H  1.896492 10.996677 -3.031778
exchangeener: -1269.730062820383 hartree
correlationener: -37.908586433939 hartree
xcener: -1307.638649254322 hartree
chargesum: -0.0000000
charge: 0.792516 0.778968 0.829511 0.795129 0.827229 0.831971 0.812152 0.819133 0.809367 0.772061 0.825319 0.796500 0.848492 0.842217 0.952030 0.855599 0.877056 0.946087 0.812612 0.778539 0.794217 0.773789 0.793116 0.806996 0.818814 0.795921 -0.306409 -0.423124 -0.424652 -0.625746 -0.317938 -0.318741 -0.322788 -0.422212 -0.466785 -0.423004 -0.311735 -0.312185 -0.458194 -0.305350 -0.405780 -0.366833 -0.447916 -0.407575 -0.315431 -0.374938 -0.369049 -0.445284 -0.319623 -0.304702 -0.462561 -0.361004 -0.317174 -0.444890 -0.479090 -0.506926 -0.423141 -0.420451 -0.414586 -0.459530 -0.453900 -0.596491 -0.453790 -0.478054 -0.478784 -0.473514 -0.504060 -0.440016 -0.460909 -0.417495 -0.439180 -0.448801 -0.474319 -0.476228 -0.467577 -0.457730 -0.303965 -0.317130 -0.327835 -0.370102 -0.318130 -0.359539 -0.366475 -0.306494 -0.447697 -0.375303 -0.306408 -0.449476 -0.446271 -0.313836 -0.322115 -0.407640 -0.405956 -0.511494 -0.309905 -0.448181 0.769768 0.783502 0.358334 0.490615 0.208743 0.122688 0.147305 0.162354 0.182892 0.174224 0.191360 0.164203 0.175367 0.157179 0.115487 0.191789 0.188401 0.135280 0.175225 0.207294 0.147287 0.163037 0.113728 0.191358 0.135017 0.163811 0.191700 0.157965 0.188500 0.174357 0.122245 0.183790
charge: 0.421347 0.435280 0.455911 0.446647 0.458708 0.457403 0.459205 0.444717 0.462024 0.432945 0.456107 0.445367 0.448550 0.438582 0.493803 0.459671 0.450105 0.492319 0.455844 0.435597 0.421587 0.433474 0.443621 0.460033 0.447771 0.449344 -0.158480 -0.237002 -0.238326 -0.243667 -0.186904 -0.182080 -0.181618 -0.236410 -0.255163 -0.237019 -0.170885 -0.171114 -0.261658 -0.158034 -0.229002 -0.195382 -0.255869 -0.229800 -0.173670 -0.195696 -0.206679 -0.251464 -0.171161 -0.161307 -0.252724 -0.194674 -0.176395 -0.236143 -0.257686 -0.266782 -0.242873 -0.236194 -0.233020 -0.241647 -0.242785 -0.238345 -0.249977 -0.258075 -0.256209 -0.254150 -0.263979 -0.238876 -0.241723 -0.242660 -0.232139 -0.243272 -0.254602 -0.248765 -0.249626 -0.262555 -0.156221 -0.180152 -0.185450 -0.207729 -0.169912 -0.193061 -0.194687 -0.158984 -0.253602 -0.195862 -0.163098 -0.256841 -0.252501 -0.173753 -0.191305 -0.229315 -0.229179 -0.236362 -0.169563 -0.253877 0.189609 0.182969 0.405358 0.423493 0.123468 0.057107 0.078520 0.084515 0.106325 0.097880 0.103096 0.081348 0.099207 0.074747 0.046309 0.106942 0.106069 0.061068 0.097463 0.121622 0.078320 0.085910 0.044797 0.106358 0.060671 0.080840 0.103546 0.075866 0.106597 0.096176 0.057070 0.106493
qa: 0.7925 0.7790 0.8295 0.7951 0.8272 0.8320 0.8122 0.8191 0.8094 0.7721 0.8253 0.7965 0.8485 0.8422 0.9520 0.8556 0.8771 0.9461 0.8126 0.7785 0.7942 0.7738 0.7931 0.8070 0.8188 0.7959 -0.3064 -0.4231 -0.4247 -0.6257 -0.3179 -0.3187 -0.3228 -0.4222 -0.4668 -0.4230 -0.3117 -0.3122 -0.4582 -0.3054 -0.4058 -0.3668 -0.4479 -0.4076 -0.3154 -0.3749 -0.3690 -0.4453 -0.3196 -0.3047 -0.4626 -0.3610 -0.3172 -0.4449 -0.4791 -0.5069 -0.4231 -0.4205 -0.4146 -0.4595 -0.4539 -0.5965 -0.4538 -0.4781 -0.4788 -0.4735 -0.5041 -0.4400 -0.4609 -0.4175 -0.4392 -0.4488 -0.4743 -0.4762 -0.4676 -0.4577 -0.3040 -0.3171 -0.3278 -0.3701 -0.3181 -0.3595 -0.3665 -0.3065 -0.4477 -0.3753 -0.3064 -0.4495 -0.4463 -0.3138 -0.3221 -0.4076 -0.4060 -0.5115 -0.3099 -0.4482 0.7698 0.7835 0.3583 0.4906 0.2087 0.1227 0.1473 0.1624 0.1829 0.1742 0.1914 0.1642 0.1754 0.1572 0.1155 0.1918 0.1884 0.1353 0.1752 0.2073 0.1473 0.1630 0.1137 0.1914 0.1350 0.1638 0.1917 0.1580 0.1885 0.1744 0.1222 0.1838
va: 4.7900 4.8128 4.7728 4.7996 4.7750 4.7691 4.7819 4.7707 4.7873 4.8151 4.7770 4.7874 4.7689 4.7646 4.6141 4.7587 4.7184 4.6239 4.7808 4.8134 4.7889 4.8131 4.7915 4.7911 4.7683 4.7998 2.2527 2.2775 2.2758 2.1574 2.1787 2.1982 2.2124 2.2770 2.2533 2.2760 2.2333 2.2273 2.2381 2.2504 2.3001 2.1631 2.2456 2.2976 2.2238 2.1467 2.1169 2.2551 2.2242 2.2365 2.2556 2.1477 2.2262 2.2787 2.2462 2.2583 2.2934 2.2865 2.2928 2.2704 2.2701 2.1923 2.2757 2.2463 2.2827 2.2490 2.2645 2.2807 2.2694 2.2992 2.2890 2.2719 2.2901 2.2874 2.2573 2.2378 2.2553 2.2014 2.2058 2.1139 2.2261 2.1496 2.1636 2.2490 2.2532 2.1471 2.2339 2.2437 2.2504 2.2304 2.1719 2.2980 2.2988 2.2586 2.2370 2.2481 3.7157 3.6951 3.8886 3.7812 0.9898 1.0336 1.0228 1.0163 1.0046 1.0094 1.0003 1.0165 1.0087 1.0203 1.0410 0.9994 1.0013 1.0326 1.0096 0.9908 1.0229 1.0158 1.0417 0.9998 1.0329 1.0169 1.0000 1.0200 1.0011 1.0103 1.0334 1.0043
dispcorr: -0.254394282 hartree
dipole: 1.49568 -4.61721 -3.12154 0.89984 -2.47435 -1.57451 5.99314 -3.15553 2.83761
magnitude: 4.50279 au
magnitude: 11.44519 debye
