program: Orca
programVersion: 5.0.2
elementType: Si Si Si Si Si Si Si Si Si Si Si Si Si Si Si Si Si Si Si Si Si Si Si Si Si Si O O O O O O O O O O O O O O O O O O O O O O O O O O O O O O O O O O O O O O O O O O O O O O O O O O O O O O O O O O O O O O O O O O O O O O Al Al Co Cd O H H O H H H H H H H H H H H H H H H H H H H H H H H H H H H H
elementType: Cd
charge: 0
multiplicity: 4
keywords: QMMM pbe d3bj def2-svp
formula: H30Al2CdCoO72Si26
InChI: InChI=1S/2Al.Cd.Co.H28O70Si26.H2O.O/c;;;;1-71(2,3)37-81(23)53-87(29)43-75(11,12)39-73(7,8)41-83(25)45-77(15,16)47-85(27)59-86(28)48-78(17,18)46-84(26,58-94(36,61-86)63-93(35,57-83)60-85)42-74(9,10)40-76(13,14)44-88(30)54-82(24,38-72(4,5)6)56-90(32)50-80(21,22)52-92(34)62-91(33)51-79(19,20)49-89(31,55-81)66-95(64-87,68-91)70-96(65-88,67-90)69-92;;/h;;;;1-2,4-5,7,9,11-28,31-34H;1H2;/q+2;+3;;;-5;;
132 atoms
Si -1.658635 13.011003 3.494629
Si 3.12626 15.779945 6.53241
Si 5.265021 9.149582 -1.581865
Si 5.299937 14.513094 1.593094
Si 1.579728 10.558657 11.566697
Si 3.728331 11.776171 -1.550161
Si -1.498962 10.508805 8.436301
Si 3.129101 15.800171 3.452886
Si -1.538426 13.081284 6.593505
Si 5.287534 14.492973 -1.528255
Si 3.124493 7.88644 11.554899
Si -1.55419 10.513864 11.571442
Si 3.088838 7.887579 8.439319
Si 5.392146 9.205287 1.521778
Si 5.273427 6.659592 6.547009
Si 1.563441 10.526615 8.456478
Si 3.855481 11.796794 1.568254
Si 1.557909 13.050446 6.580317
Si 1.543956 5.249629 8.430205
Si 8.410488 6.618592 6.537243
Si 3.619906 3.858329 3.498669
Si 8.392173 9.13129 -1.536179
Si 1.514939 5.196892 11.565946
Si 3.755795 3.942897 6.581861
Si 8.437887 6.59356 3.455693
Si 8.43435 9.121771 1.584632
O  -2.434133 11.562957 12.401061
O  2.464768 6.464179 11.940413
O  0.015987 10.705803 11.946244
O  4.960557 7.263374 5.070934
O  6.830905 14.799898 2.111721
O  -2.482308 9.321628 7.9176
O  2.626988 17.255179 2.91814
O  4.347912 13.238408 -1.909914
O  4.827214 10.661677 -1.97527
O  6.838945 8.964282 -1.940076
O  4.4189 8.05938 -2.417782
O  4.492453 8.077011 12.398037
O  3.622468 15.959808 4.999519
O  -2.564285 11.923197 2.741735
O  4.423132 15.489113 2.49967
O  1.926713 16.82482 6.90385
O  5.201977 14.942523 0.026688
O  -1.83917 11.813994 7.557867
O  2.426882 11.655807 12.401816
O  -1.963312 14.571426 3.110118
O  6.81835 14.007665 -1.919744
O  -1.951699 12.737194 5.085226
O  4.453678 15.951986 7.427041
O  4.814021 15.768315 -2.385397
O  2.049899 9.049578 11.910086
O  -1.889054 8.94875 11.919311
O  -2.453815 14.296215 7.154803
O  5.013491 8.873916 -0.008279
O  1.885631 6.838953 8.247033
O  6.916364 6.158915 3.338535
O  4.415371 7.599525 7.569244
O  2.535922 14.303545 6.874639
O  6.845395 6.818151 6.910575
O  4.905094 5.101325 6.695189
O  4.505698 10.427806 2.141635
O  1.875556 12.420264 5.105452
O  2.588285 9.369277 7.937385
O  0.050256 10.032561 8.233468
O  4.205069 5.310318 3.186438
O  6.925056 9.697956 1.687985
O  2.01731 14.665717 3.358357
O  3.543944 7.96486 9.982728
O  0.035326 13.529659 6.727227
O  1.963892 11.849422 7.601485
O  3.376102 11.683111 0.030101
O  1.848012 10.899466 9.993389
O  -0.107561 12.795021 3.172514
O  4.969081 7.973217 2.444352
O  5.005769 12.929527 1.731576
O  8.813353 6.951619 4.999916
O  1.981299 3.915176 12.404959
O  0.020372 4.991845 7.916702
O  9.478094 5.455348 2.921869
O  8.734561 10.700189 -1.928849
O  9.242881 7.68402 7.413452
O  -0.007766 5.693307 11.918929
O  8.730536 5.058697 6.911771
O  2.223941 3.618532 2.743217
O  3.229802 3.715578 5.087243
O  4.814551 2.809807 3.103207
O  9.248573 8.078558 -2.396186
O  8.747973 8.826168 0.013326
O  1.645855 4.822573 9.987229
O  4.369495 2.551319 7.153225
O  9.455488 10.299681 2.100878
O  2.508678 4.303062 7.563307
O  8.810889 7.874139 2.49412
O  2.590078 12.015074 2.525194
O  2.355972 11.584398 -2.381521
O  -1.812211 10.817835 9.989644
Al 5.265804 6.591172 3.461622
Al 1.536722 13.036751 3.452473
Co 1.901221 10.635503 4.403318
Cd 3.771801 8.992333 4.329463
O  4.301224 10.550217 6.17374
H  4.129786 11.488686 6.325576
H  3.824583 10.076104 6.888485
O  1.73945 9.052049 4.195684
H  -3.170355 11.697215 13.035463
H  7.716365 14.617202 1.777678
H  -2.839963 8.479678 8.247499
H  2.004626 17.92678 3.241338
H  3.658852 7.949063 -3.029761
H  4.934519 8.67507 13.034185
H  -3.22539 11.852677 2.044079
H  1.711227 17.743238 6.696163
H  3.167289 11.736477 13.035782
H  -2.620505 15.239144 3.322516
H  7.708343 14.283776 -1.6965
H  4.918123 16.544594 8.040066
H  5.073207 16.465364 -3.016067
H  -2.589105 8.325134 11.70909
H  -2.827915 15.125905 6.802278
H  1.731596 3.206779 13.037112
H  -0.887901 5.100716 8.247119
H  9.729533 4.575023 3.242915
H  9.415129 11.332394 -1.70035
H  9.980835 7.787214 8.034319
H  -0.897086 5.395759 11.708928
H  9.413428 4.410433 6.699512
H  1.83691 3.079779 2.044706
H  5.070718 1.908243 3.319594
H  9.983242 7.957173 -3.02063
H  4.885239 1.797378 6.801611
H  9.719974 11.166172 1.773093
H  1.892739 10.987736 -3.014428
exchangeener: -1243.675643701830 hartree
correlationener: -38.191959786601 hartree
xcener: -1281.867603488432 hartree
s2: 3.767189
chargesum: -0.0000000
charge: 0.800709 0.772662 0.833469 0.792123 0.829695 0.836479 0.819567 0.818059 0.805485 0.779550 0.830884 0.797273 0.891412 0.899260 0.957591 0.868266 0.902910 0.956118 0.818358 0.774702 0.793435 0.773626 0.797309 0.807061 0.814975 0.794279 -0.306291 -0.425237 -0.425055 -0.622244 -0.318441 -0.310643 -0.322310 -0.424574 -0.466798 -0.422193 -0.309782 -0.316661 -0.456775 -0.300404 -0.404543 -0.364532 -0.448730 -0.406704 -0.316168 -0.372230 -0.370836 -0.446906 -0.317944 -0.308235 -0.463046 -0.360014 -0.312231 -0.437589 -0.473682 -0.499833 -0.437877 -0.426853 -0.420681 -0.459458 -0.478619 -0.645576 -0.510301 -0.471779 -0.479014 -0.467918 -0.500244 -0.441634 -0.455651 -0.453741 -0.447197 -0.441458 -0.482649 -0.529471 -0.471082 -0.457793 -0.307131 -0.312337 -0.322687 -0.369684 -0.319193 -0.362099 -0.365723 -0.301239 -0.444122 -0.377055 -0.304562 -0.448339 -0.447834 -0.318377 -0.317056 -0.406715 -0.404619 -0.514486 -0.315044 -0.446986 0.831620 0.774269 0.506511 0.609608 -0.231934 0.183158 0.193732 -0.464182 0.210162 0.122089 0.149102 0.162252 0.185324 0.176821 0.192311 0.165808 0.176864 0.156836 0.116327 0.192284 0.191353 0.136935 0.173887 0.210141 0.147369 0.160845 0.114692 0.189094 0.135915 0.162232 0.189853 0.155808 0.189122 0.174311 0.121536 0.187603
charge: 0.422528 0.433261 0.457386 0.448285 0.459454 0.462451 0.460319 0.446006 0.459738 0.436337 0.460798 0.446342 0.470473 0.467111 0.504832 0.458728 0.470748 0.482134 0.462547 0.434325 0.423442 0.433810 0.446194 0.462029 0.444692 0.447668 -0.158116 -0.238872 -0.238781 -0.237899 -0.187406 -0.173598 -0.181239 -0.238563 -0.256325 -0.236216 -0.169035 -0.174688 -0.261316 -0.152393 -0.228446 -0.192453 -0.256320 -0.227829 -0.174257 -0.194371 -0.208229 -0.250272 -0.170093 -0.164354 -0.253546 -0.193500 -0.172406 -0.232298 -0.251427 -0.264964 -0.243423 -0.239400 -0.237657 -0.244392 -0.231769 -0.250616 -0.251471 -0.250059 -0.252232 -0.249338 -0.263365 -0.244111 -0.244058 -0.255527 -0.238981 -0.242810 -0.252462 -0.228799 -0.251926 -0.260930 -0.159049 -0.176407 -0.183028 -0.207224 -0.171434 -0.195866 -0.194990 -0.155466 -0.250362 -0.198100 -0.161220 -0.256074 -0.254030 -0.178020 -0.186806 -0.228770 -0.227703 -0.244817 -0.173326 -0.253569 0.202376 0.155345 0.438333 0.348600 -0.011618 0.090636 0.063430 -0.222527 0.124767 0.056792 0.079883 0.084485 0.108446 0.100786 0.104127 0.082400 0.100339 0.074507 0.047398 0.106787 0.109784 0.062506 0.095514 0.125139 0.078723 0.082518 0.045625 0.104308 0.061580 0.079681 0.101900 0.074048 0.107098 0.096548 0.056217 0.110680
qa: 0.8007 0.7727 0.8335 0.7921 0.8297 0.8365 0.8196 0.8181 0.8055 0.7796 0.8309 0.7973 0.8914 0.8993 0.9576 0.8683 0.9029 0.9561 0.8184 0.7747 0.7934 0.7736 0.7973 0.8071 0.8150 0.7943 -0.3063 -0.4252 -0.4251 -0.6222 -0.3184 -0.3106 -0.3223 -0.4246 -0.4668 -0.4222 -0.3098 -0.3167 -0.4568 -0.3004 -0.4045 -0.3645 -0.4487 -0.4067 -0.3162 -0.3722 -0.3708 -0.4469 -0.3179 -0.3082 -0.4630 -0.3600 -0.3122 -0.4376 -0.4737 -0.4998 -0.4379 -0.4269 -0.4207 -0.4595 -0.4786 -0.6456 -0.5103 -0.4718 -0.4790 -0.4679 -0.5002 -0.4416 -0.4557 -0.4537 -0.4472 -0.4415 -0.4826 -0.5295 -0.4711 -0.4578 -0.3071 -0.3123 -0.3227 -0.3697 -0.3192 -0.3621 -0.3657 -0.3012 -0.4441 -0.3771 -0.3046 -0.4483 -0.4478 -0.3184 -0.3171 -0.4067 -0.4046 -0.5145 -0.3150 -0.4470 0.8316 0.7743 0.5065 0.6096 -0.2319 0.1832 0.1937 -0.4642 0.2102 0.1221 0.1491 0.1623 0.1853 0.1768 0.1923 0.1658 0.1769 0.1568 0.1163 0.1923 0.1914 0.1369 0.1739 0.2101 0.1474 0.1608 0.1147 0.1891 0.1359 0.1622 0.1899 0.1558 0.1891 0.1743 0.1215 0.1876
va: 4.7838 4.8210 4.7682 4.8037 4.7714 4.7638 4.7719 4.7683 4.7924 4.8060 4.7698 4.7863 4.7079 4.6865 4.6113 4.7460 4.6932 4.6217 4.7738 4.8184 4.7894 4.8130 4.7865 4.7886 4.7786 4.8009 2.2541 2.2758 2.2759 2.1337 2.1765 2.2117 2.2130 2.2749 2.2532 2.2772 2.2383 2.2235 2.2381 2.2579 2.2998 2.1680 2.2450 2.2989 2.2249 2.1518 2.1153 2.2528 2.2268 2.2334 2.2547 2.1505 2.2318 2.2909 2.2588 2.2682 2.2849 2.2866 2.2875 2.2686 2.2485 2.1198 2.2129 2.2603 2.2866 2.2586 2.2691 2.2836 2.2725 2.2672 2.2791 2.2828 2.2846 2.2276 2.2564 2.2379 2.2525 2.2067 2.2116 2.1155 2.2221 2.1471 2.1625 2.2536 2.2554 2.1428 2.2369 2.2452 2.2486 2.2236 2.1783 2.2987 2.3008 2.2522 2.2333 2.2505 3.6309 3.7163 4.7929 2.3123 2.3022 1.0388 1.0442 2.3193 0.9890 1.0338 1.0224 1.0165 1.0034 1.0079 1.0001 1.0159 1.0079 1.0206 1.0406 0.9992 0.9993 1.0320 1.0105 0.9889 1.0231 1.0172 1.0414 1.0010 1.0323 1.0175 1.0013 1.0209 1.0009 1.0100 1.0341 1.0020
dispcorr: -0.266741199 hartree
dipole: -17.08711 13.96131 -3.12580 55.06522 -55.87314 -0.80791 53.11218 -49.94672 3.16546
magnitude: 4.52144 au
magnitude: 11.49259 debye
