program: Orca
programVersion: 5.0.2
elementType: Si Si Si Si Si Si Si Si Si Si Si Si Si Si Si Si Si Si Si Si Si Si Si Si Si Si O O O O O O O O O O O O O O O O O O O O O O O O O O O O O O O O O O O O O O O O O O O O O O O O O O O O O O O O O O O O O O O O O O O O O O Al Al Co Cd O O H H H H H H H H H H H H H H H H H H H H H H H H H H H H
elementType: Cd
charge: 0
multiplicity: 4
keywords: QMMM pbe d3bj def2-svp
formula: H28Al2CdCoO72Si26
InChI: InChI=1S/2Al.Cd.Co.H28O70Si26.O2/c;;;;1-71(2,3)37-81(23)53-87(29)43-75(11,12)39-73(7,8)41-83(25)45-77(15,16)47-85(27)59-86(28)48-78(17,18)46-84(26,58-94(36,61-86)63-93(35,57-83)60-85)42-74(9,10)40-76(13,14)44-88(30)54-82(24,38-72(4,5)6)56-90(32)50-80(21,22)52-92(34)62-91(33)51-79(19,20)49-89(31,55-81)66-95(64-87,68-91)70-96(65-88,67-90)69-92;1-2/h;;;;1-2,4-5,7,9,11-28,31-34H;/q+2;+3;;+2;-5;-2
130 atoms
Si -1.674778 13.013313 3.496027
Si 3.128313 15.786361 6.535665
Si 5.273511 9.159405 -1.594911
Si 5.304006 14.559443 1.58616
Si 1.573433 10.564993 11.570735
Si 3.692491 11.801125 -1.542375
Si -1.504425 10.517264 8.450762
Si 3.145409 15.833089 3.438629
Si -1.540898 13.071337 6.581522
Si 5.288624 14.504692 -1.531401
Si 3.122753 7.876301 11.5640
Si -1.557885 10.518328 11.575881
Si 3.111795 7.863519 8.465979
Si 5.41978 9.176411 1.504766
Si 5.273152 6.553738 6.62905
Si 1.569446 10.528296 8.48506
Si 3.834797 11.821746 1.524547
Si 1.573359 13.046442 6.593404
Si 1.543801 5.22585 8.446704
Si 8.385861 6.626071 6.552128
Si 3.616117 3.845384 3.497015
Si 8.386974 9.141032 -1.550173
Si 1.512457 5.19326 11.577179
Si 3.742419 3.900122 6.613944
Si 8.403017 6.588057 3.454391
Si 8.431511 9.121821 1.580667
O  -2.436489 11.571762 12.403017
O  2.448142 6.462869 11.966528
O  0.007778 10.699524 11.961067
O  5.069879 7.033879 5.101522
O  6.835437 14.788478 2.120896
O  -2.48783 9.329511 7.922077
O  2.637985 17.281967 2.904145
O  4.33907 13.25257 -1.894315
O  4.795057 10.679954 -1.917737
O  6.842223 9.004823 -1.993111
O  4.433569 8.084156 -2.450236
O  4.475963 8.061548 12.432614
O  3.607071 15.957952 4.990651
O  -2.53672 11.912203 2.71312
O  4.452953 15.552669 2.496816
O  1.932472 16.832783 6.905663
O  5.219517 14.977307 0.019613
O  -1.846982 11.817806 7.552651
O  2.406944 11.653843 12.431381
O  -1.972313 14.569722 3.097616
O  6.816093 14.010261 -1.918385
O  -1.984416 12.729759 5.074543
O  4.473624 15.972459 7.396075
O  4.807118 15.770743 -2.393548
O  2.05138 9.053354 11.887028
O  -1.897306 8.954292 11.923344
O  -2.433227 14.30211 7.143913
O  5.080745 8.82899 -0.031276
O  1.914446 6.800017 8.264514
O  6.916404 6.079824 3.273966
O  4.442675 7.536603 7.614381
O  2.509773 14.330649 6.889132
O  6.849506 6.795812 7.014251
O  4.94151 4.995208 6.825136
O  4.56266 10.474072 1.983861
O  1.965006 12.487162 5.076129
O  2.541949 9.324613 8.057634
O  0.041184 10.054478 8.257837
O  4.19438 5.274044 3.094417
O  6.941145 9.724892 1.74485
O  2.046835 14.686046 3.277118
O  3.584937 7.891673 10.010641
O  0.040755 13.514636 6.630913
O  1.926536 11.858524 7.610684
O  3.252262 11.776852 0.026564
O  1.812983 10.970485 10.013783
O  -0.11491 12.815169 3.172314
O  5.087138 7.928186 2.408084
O  4.93217 12.992705 1.735247
O  8.661777 7.056172 5.001269
O  1.98782 3.913717 12.415349
O  0.018979 4.984528 7.920314
O  9.532142 5.497954 3.012254
O  8.73457 10.709316 -1.934526
O  9.272732 7.702544 7.369861
O  -0.011247 5.685971 11.932853
O  8.737833 5.067848 6.875317
O  2.19565 3.574654 2.79183
O  3.26301 3.740648 5.095483
O  4.804777 2.795804 3.090518
O  9.254828 8.082774 -2.39018
O  8.721064 8.834744 0.006218
O  1.633437 4.795375 10.003754
O  4.291528 2.474778 7.16664
O  9.467456 10.29313 2.101171
O  2.477786 4.256694 7.566877
O  8.796098 7.869646 2.492563
O  2.604565 11.960088 2.594053
O  2.334851 11.604374 -2.392341
O  -1.838077 10.831639 9.998205
Al 5.245624 6.541914 3.436993
Al 1.512008 13.08726 3.425074
Co 2.789601 11.050535 4.358573
Cd 6.160077 9.156693 4.78818
O  3.521831 9.609159 4.184597
O  3.427234 9.909465 5.50293
H  -3.171351 11.700939 13.036291
H  7.718281 14.612374 1.781558
H  -2.842298 8.483011 8.249392
H  2.009276 17.938107 3.23542
H  3.665054 7.95954 -3.043485
H  4.927546 8.668532 13.048805
H  -3.213734 11.848028 2.03198
H  1.713662 17.746605 6.696929
H  3.158858 11.735646 13.048284
H  -2.624311 15.238424 3.31723
H  7.707389 14.284874 -1.695926
H  4.926557 16.553251 8.026972
H  5.070288 16.466391 -3.019514
H  -2.592595 8.327478 11.710795
H  -2.819209 15.128398 6.797674
H  1.734353 3.206162 13.041505
H  -0.88849 5.097622 8.248647
H  9.752387 4.593039 3.281134
H  9.415133 11.336253 -1.702751
H  9.993458 7.795047 8.015887
H  -0.898559 5.392657 11.714816
H  9.416513 4.414302 6.684097
H  1.824947 3.061225 2.065262
H  5.066586 1.902322 3.314228
H  9.985887 7.958956 -3.01809
H  4.85227 1.765012 6.807284
H  9.725034 11.163402 1.773217
H  1.883808 10.996183 -3.019004
exchangeener: -1242.925557412037 hartree
correlationener: -38.129683168223 hartree
xcener: -1281.055240580260 hartree
s2: 3.761075
chargesum: 0.0000000
charge: 0.792797 0.773460 0.829884 0.790169 0.824683 0.839890 0.813062 0.820369 0.809269 0.776075 0.823579 0.793625 0.874635 0.863198 0.936010 0.864320 0.916532 0.962348 0.810099 0.805909 0.787791 0.772137 0.791447 0.800694 0.803282 0.812524 -0.306510 -0.425060 -0.425358 -0.582806 -0.314155 -0.316034 -0.313512 -0.424177 -0.468422 -0.421945 -0.304609 -0.316020 -0.458100 -0.298336 -0.403305 -0.360231 -0.447462 -0.406838 -0.315453 -0.371342 -0.369296 -0.444055 -0.315294 -0.303657 -0.464422 -0.359243 -0.312801 -0.428566 -0.474284 -0.507599 -0.421033 -0.417016 -0.448447 -0.452977 -0.445223 -0.635183 -0.420551 -0.474786 -0.470807 -0.492689 -0.502334 -0.449392 -0.465500 -0.417176 -0.443713 -0.447307 -0.473461 -0.483546 -0.464450 -0.480754 -0.306478 -0.315025 -0.317399 -0.366360 -0.329441 -0.360983 -0.351793 -0.305212 -0.442373 -0.373610 -0.303411 -0.442382 -0.448405 -0.311674 -0.326162 -0.404860 -0.418112 -0.561862 -0.309484 -0.448198 0.786299 0.815200 0.660596 0.396227 -0.187104 -0.156772 0.206661 0.122509 0.148731 0.161186 0.183082 0.171882 0.191585 0.162728 0.172751 0.157159 0.117917 0.192391 0.190578 0.135102 0.172666 0.205954 0.144403 0.161891 0.112659 0.191596 0.133516 0.162042 0.188729 0.151390 0.189993 0.168454 0.121411 0.187265
charge: 0.422569 0.433783 0.454713 0.444533 0.455846 0.464226 0.458993 0.443608 0.463307 0.435679 0.455716 0.443827 0.471391 0.436688 0.479818 0.466065 0.472033 0.504206 0.457342 0.432497 0.419391 0.434165 0.442687 0.457048 0.434377 0.445195 -0.158702 -0.238766 -0.239102 -0.228353 -0.182642 -0.179387 -0.174708 -0.237897 -0.255474 -0.235865 -0.164418 -0.174866 -0.259728 -0.151679 -0.227342 -0.188958 -0.255319 -0.229003 -0.174593 -0.191824 -0.206848 -0.250264 -0.166397 -0.159794 -0.253409 -0.193140 -0.172559 -0.229868 -0.254129 -0.267593 -0.231592 -0.234799 -0.241715 -0.241311 -0.234436 -0.230175 -0.232778 -0.254802 -0.248843 -0.249959 -0.262783 -0.245375 -0.245806 -0.237826 -0.234936 -0.243694 -0.251882 -0.228260 -0.248628 -0.256273 -0.158745 -0.179497 -0.179260 -0.204479 -0.174400 -0.195550 -0.182929 -0.159134 -0.248308 -0.194774 -0.159960 -0.253287 -0.253853 -0.173318 -0.191017 -0.227428 -0.228905 -0.223576 -0.168884 -0.253633 0.178105 0.201517 0.364059 0.323839 -0.002952 -0.044289 0.121265 0.056928 0.079675 0.082438 0.106672 0.096613 0.102849 0.079303 0.096942 0.073987 0.048738 0.106688 0.108285 0.061133 0.094913 0.120836 0.075986 0.083304 0.043331 0.106576 0.059467 0.080100 0.100332 0.069431 0.107704 0.090043 0.056334 0.109578
qa: 0.7928 0.7735 0.8299 0.7902 0.8247 0.8399 0.8131 0.8204 0.8093 0.7761 0.8236 0.7936 0.8746 0.8632 0.9360 0.8643 0.9165 0.9623 0.8101 0.8059 0.7878 0.7721 0.7914 0.8007 0.8033 0.8125 -0.3065 -0.4251 -0.4254 -0.5828 -0.3142 -0.3160 -0.3135 -0.4242 -0.4684 -0.4219 -0.3046 -0.3160 -0.4581 -0.2983 -0.4033 -0.3602 -0.4475 -0.4068 -0.3155 -0.3713 -0.3693 -0.4441 -0.3153 -0.3037 -0.4644 -0.3592 -0.3128 -0.4286 -0.4743 -0.5076 -0.4210 -0.4170 -0.4484 -0.4530 -0.4452 -0.6352 -0.4206 -0.4748 -0.4708 -0.4927 -0.5023 -0.4494 -0.4655 -0.4172 -0.4437 -0.4473 -0.4735 -0.4835 -0.4645 -0.4808 -0.3065 -0.3150 -0.3174 -0.3664 -0.3294 -0.3610 -0.3518 -0.3052 -0.4424 -0.3736 -0.3034 -0.4424 -0.4484 -0.3117 -0.3262 -0.4049 -0.4181 -0.5619 -0.3095 -0.4482 0.7863 0.8152 0.6606 0.3962 -0.1871 -0.1568 0.2067 0.1225 0.1487 0.1612 0.1831 0.1719 0.1916 0.1627 0.1728 0.1572 0.1179 0.1924 0.1906 0.1351 0.1727 0.2060 0.1444 0.1619 0.1127 0.1916 0.1335 0.1620 0.1887 0.1514 0.1900 0.1685 0.1214 0.1873
va: 4.7882 4.8188 4.7690 4.8056 4.7773 4.7576 4.7814 4.7724 4.7862 4.8103 4.7788 4.7915 4.7299 4.7318 4.6451 4.7449 4.6723 4.6008 4.7856 4.7751 4.7902 4.8140 4.7938 4.7940 4.7987 4.7772 2.2513 2.2751 2.2748 2.1857 2.1838 2.2035 2.2243 2.2749 2.2518 2.2772 2.2420 2.2189 2.2388 2.2602 2.3029 2.1707 2.2466 2.2982 2.2211 2.1518 2.1185 2.2556 2.2312 2.2395 2.2529 2.1492 2.2295 2.2974 2.2524 2.2525 2.3045 2.2914 2.2636 2.2788 2.2854 2.1563 2.3053 2.2510 2.2925 2.2339 2.2719 2.2714 2.2656 2.3045 2.2880 2.2738 2.2981 2.2837 2.2609 2.2179 2.2505 2.2004 2.2201 2.1182 2.2188 2.1460 2.1832 2.2484 2.2547 2.1429 2.2395 2.2541 2.2477 2.2284 2.1710 2.3002 2.2910 2.2183 2.2399 2.2487 3.6870 3.6572 4.3693 1.8667 2.2366 2.2007 0.9911 1.0340 1.0221 1.0174 1.0046 1.0103 1.0006 1.0176 1.0098 1.0206 1.0400 0.9994 1.0001 1.0328 1.0113 0.9915 1.0242 1.0167 1.0424 0.9999 1.0334 1.0178 1.0019 1.0232 1.0005 1.0132 1.0341 1.0023
dispcorr: -0.262792102 hartree
dipole: -177.80026 175.50451 -2.29576 40.94138 -41.10756 -0.16618 19.85215 -18.04546 1.80669
magnitude: 2.92613 au
magnitude: 7.43763 debye
