program: Orca
programVersion: 5.0.2
elementType: Si Si Si Si Si Si Si Si Si Si Si Si Si Si Si Si Si Si Si Si Si Si Si Si Si Si O O O O O O O O O O O O O O O O O O O O O O O O O O O O O O O O O O O O O O O O O O O O O O O O O O O O O O O O O O O O O O O O O O O O O O Al Al Co Cd O C H H H H O O H H H H H H H H H H H H H H H H H H H H H H H H H H H H
elementType: Cd
charge: 0
multiplicity: 4
keywords: QMMM pbe d3bj def2-svp
formula: CH32Al2CdCoO73Si26
InChI: InChI=1S/CH4O.2Al.Cd.Co.H28O70Si26.O2/c1-2;;;;;1-71(2,3)37-81(23)53-87(29)43-75(11,12)39-73(7,8)41-83(25)45-77(15,16)47-85(27)59-86(28)48-78(17,18)46-84(26,58-94(36,61-86)63-93(35,57-83)60-85)42-74(9,10)40-76(13,14)44-88(30)54-82(24,38-72(4,5)6)56-90(32)50-80(21,22)52-92(34)62-91(33)51-79(19,20)49-89(31,55-81)66-95(64-87,68-91)70-96(65-88,67-90)69-92;1-2/h2H,1H3;;;;;1-2,4-5,7,9,11-28,31-34H;/q;+2;+3;;+1;-5;-1
136 atoms
Si -1.664267 13.001901 3.499842
Si 3.117448 15.773138 6.559593
Si 5.272929 9.143109 -1.60582
Si 5.302012 14.475222 1.593838
Si 1.577206 10.548953 11.576131
Si 3.73589 11.779166 -1.571003
Si -1.519135 10.516386 8.446604
Si 3.101051 15.769465 3.453847
Si -1.569664 13.079841 6.590775
Si 5.288297 14.494568 -1.526458
Si 3.127841 7.887533 11.54994
Si -1.557295 10.512449 11.577889
Si 3.084611 7.895167 8.431502
Si 5.373691 9.197175 1.481167
Si 5.275845 6.659054 6.5466
Si 1.544863 10.527639 8.463614
Si 3.856125 11.798609 1.528512
Si 1.539393 13.092224 6.629308
Si 1.54508 5.237485 8.433241
Si 8.407436 6.620979 6.539821
Si 3.614223 3.846278 3.493082
Si 8.392586 9.132072 -1.53935
Si 1.517325 5.193523 11.564851
Si 3.753247 3.937801 6.579517
Si 8.429325 6.592609 3.450891
Si 8.404559 9.1409 1.587949
O  -2.432177 11.563608 12.408728
O  2.472495 6.458688 11.925894
O  0.012452 10.697482 11.951648
O  4.976142 7.228257 5.045701
O  6.826259 14.811273 2.095945
O  -2.481307 9.315399 7.909954
O  2.653746 17.256401 2.948194
O  4.358984 13.236821 -1.929245
O  4.831987 10.654023 -1.983928
O  6.845485 8.960874 -1.965095
O  4.428013 8.049374 -2.437054
O  4.494765 8.075862 12.394523
O  3.576369 15.878632 5.009719
O  -2.558646 11.903902 2.738918
O  4.391017 15.415178 2.504898
O  1.930737 16.83762 6.91795
O  5.191423 14.931724 0.029534
O  -1.866361 11.80625 7.55239
O  2.418244 11.645359 12.414933
O  -1.972071 14.558561 3.108336
O  6.818954 14.011313 -1.923817
O  -1.987137 12.722716 5.087645
O  4.471299 15.97677 7.40059
O  4.814422 15.771865 -2.381309
O  2.045108 9.037618 11.91782
O  -1.889838 8.946052 11.922797
O  -2.491208 14.285264 7.159266
O  5.020027 8.820872 -0.040094
O  1.896985 6.819754 8.229285
O  6.915274 6.123861 3.320073
O  4.388289 7.604003 7.529254
O  2.472686 14.353655 7.011641
O  6.84294 6.806703 6.921935
O  4.894442 5.102975 6.688597
O  4.389429 10.357148 2.064028
O  1.942127 12.57424 5.131515
O  2.480162 9.318399 7.891537
O  0.024988 10.032099 8.229908
O  4.180486 5.299025 3.15207
O  6.892756 9.716938 1.687641
O  1.939099 14.69236 3.320265
O  3.535219 7.967822 9.973078
O  0.001816 13.529098 6.719818
O  1.900195 11.845767 7.602274
O  3.355899 11.671124 -0.002553
O  1.83524 10.876217 10.000689
O  -0.117309 12.746319 3.200934
O  4.996217 7.962035 2.435958
O  5.059363 12.876163 1.656393
O  8.784602 6.955757 4.996041
O  1.983514 3.912792 12.404794
O  0.018772 5.005816 7.906597
O  9.483566 5.462323 2.92676
O  8.738717 10.69811 -1.934144
O  9.252036 7.678299 7.407154
O  -0.005536 5.691735 11.914086
O  8.725582 5.056833 6.901615
O  2.206621 3.616447 2.752048
O  3.226835 3.721851 5.08155
O  4.808767 2.804213 3.095029
O  9.264049 8.073116 -2.376671
O  8.71439 8.832861 0.017918
O  1.641011 4.806743 9.986412
O  4.365554 2.547301 7.148953
O  9.444646 10.300803 2.094219
O  2.495339 4.290495 7.548046
O  8.767043 7.880567 2.48943
O  2.625031 12.113392 2.490695
O  2.36798 11.591869 -2.408834
O  -1.831648 10.817343 9.999072
Al 5.264141 6.551392 3.431245
Al 1.522557 13.033653 3.461287
Co 3.663128 11.942008 4.77286
Cd 4.600979 9.196005 4.371769
O  2.53072 9.614297 5.161094
C  1.187241 9.377171 4.681455
H  1.034557 8.305338 4.520908
H  2.538568 9.474312 6.138925
H  0.463146 9.754827 5.406305
H  1.074145 9.928656 3.742859
O  5.192958 10.630193 5.563572
O  5.33644 11.604057 4.514932
H  -3.169528 11.697491 13.038705
H  7.714401 14.622012 1.771007
H  -2.83954 8.477044 8.244266
H  2.01594 17.927297 3.254046
H  3.662705 7.944833 -3.037911
H  4.935496 8.674584 13.032699
H  -3.223005 11.844518 2.042888
H  1.712928 17.748651 6.702125
H  3.163636 11.732059 13.041329
H  -2.624209 15.233704 3.321763
H  7.708599 14.285319 -1.698222
H  4.925574 16.555074 8.028881
H  5.073376 16.466866 -3.014339
H  -2.589437 8.323993 11.710564
H  -2.843726 15.121274 6.804165
H  1.732532 3.205771 13.037042
H  -0.888577 5.106623 8.242846
H  9.731846 4.577972 3.244983
H  9.416887 11.331514 -1.702589
H  9.984706 7.784795 8.031656
H  -0.896144 5.395095 11.70688
H  9.411333 4.409645 6.695218
H  1.829586 3.078897 2.04844
H  5.068273 1.905878 3.316136
H  9.989787 7.954872 -3.012378
H  4.883572 1.795679 6.799804
H  9.715389 11.166647 1.770277
H  1.897817 10.990895 -3.025978
exchangeener: -1257.790993920778 hartree
correlationener: -38.742745620677 hartree
xcener: -1296.533739541455 hartree
s2: 3.758006
chargesum: -0.0000000
charge: 0.788849 0.778082 0.827208 0.805683 0.830692 0.830886 0.812684 0.811945 0.800142 0.778236 0.834107 0.796002 0.885983 0.926584 0.979102 0.879095 0.901561 0.958838 0.810545 0.781870 0.788363 0.771946 0.798810 0.805537 0.816451 0.804690 -0.303916 -0.425906 -0.424429 -0.644562 -0.315276 -0.316220 -0.327721 -0.423820 -0.466287 -0.421256 -0.306124 -0.316114 -0.459931 -0.305354 -0.411072 -0.359575 -0.448851 -0.408548 -0.312780 -0.374498 -0.371653 -0.446349 -0.314386 -0.308551 -0.462565 -0.359774 -0.309442 -0.427699 -0.476781 -0.503703 -0.431407 -0.424194 -0.424156 -0.458021 -0.489016 -0.648249 -0.509603 -0.485305 -0.473453 -0.477494 -0.499950 -0.445821 -0.459348 -0.428510 -0.436018 -0.437795 -0.483947 -0.536073 -0.480897 -0.459135 -0.306235 -0.317661 -0.322911 -0.368038 -0.313560 -0.362433 -0.366228 -0.302934 -0.443781 -0.372988 -0.304617 -0.446077 -0.446760 -0.315938 -0.311837 -0.407367 -0.408650 -0.512280 -0.311304 -0.442474 0.857853 0.830601 0.500086 0.581614 -0.373105 0.076398 0.070378 0.255972 0.055461 0.096990 -0.308727 -0.256440 0.209005 0.122955 0.145765 0.164001 0.182685 0.179065 0.190279 0.159621 0.177767 0.158692 0.115547 0.189410 0.190884 0.136145 0.172547 0.210047 0.146298 0.162661 0.115720 0.189615 0.136494 0.161912 0.188939 0.156914 0.189717 0.173783 0.124546 0.183630
charge: 0.420636 0.427532 0.453487 0.454560 0.460298 0.457796 0.452455 0.442803 0.457082 0.435431 0.463878 0.445707 0.472553 0.466301 0.510033 0.462553 0.456797 0.483137 0.457726 0.436010 0.418778 0.432339 0.447118 0.460102 0.446448 0.452919 -0.155994 -0.239164 -0.237847 -0.231477 -0.183357 -0.178363 -0.187548 -0.237370 -0.255070 -0.235308 -0.166601 -0.173923 -0.259218 -0.159273 -0.229106 -0.190714 -0.258430 -0.228830 -0.171119 -0.194123 -0.208938 -0.252020 -0.163855 -0.164878 -0.252779 -0.193032 -0.170191 -0.227410 -0.259200 -0.266590 -0.237372 -0.235984 -0.235076 -0.245454 -0.221655 -0.237149 -0.246970 -0.258350 -0.251598 -0.242811 -0.270754 -0.242416 -0.243146 -0.240565 -0.235907 -0.237983 -0.256371 -0.216872 -0.250276 -0.259135 -0.158200 -0.181304 -0.184345 -0.205579 -0.165711 -0.195872 -0.195798 -0.157316 -0.250589 -0.193141 -0.161014 -0.255370 -0.253255 -0.175260 -0.180586 -0.230147 -0.227796 -0.243958 -0.170974 -0.251474 0.213284 0.171712 0.430248 0.281566 -0.030369 0.079894 0.034093 0.074100 0.027389 0.043197 -0.170269 -0.142641 0.123327 0.058122 0.076650 0.086697 0.105321 0.102697 0.101692 0.076784 0.101140 0.076675 0.046629 0.104288 0.109402 0.061620 0.093812 0.124872 0.077514 0.084449 0.046379 0.105118 0.062177 0.079534 0.100042 0.074579 0.107410 0.095916 0.058929 0.106808
qa: 0.7888 0.7781 0.8272 0.8057 0.8307 0.8309 0.8127 0.8119 0.8001 0.7782 0.8341 0.7960 0.8860 0.9266 0.9791 0.8791 0.9016 0.9588 0.8105 0.7819 0.7884 0.7719 0.7988 0.8055 0.8165 0.8047 -0.3039 -0.4259 -0.4244 -0.6446 -0.3153 -0.3162 -0.3277 -0.4238 -0.4663 -0.4213 -0.3061 -0.3161 -0.4599 -0.3054 -0.4111 -0.3596 -0.4489 -0.4085 -0.3128 -0.3745 -0.3717 -0.4463 -0.3144 -0.3086 -0.4626 -0.3598 -0.3094 -0.4277 -0.4768 -0.5037 -0.4314 -0.4242 -0.4242 -0.4580 -0.4890 -0.6482 -0.5096 -0.4853 -0.4735 -0.4775 -0.5000 -0.4458 -0.4593 -0.4285 -0.4360 -0.4378 -0.4839 -0.5361 -0.4809 -0.4591 -0.3062 -0.3177 -0.3229 -0.3680 -0.3136 -0.3624 -0.3662 -0.3029 -0.4438 -0.3730 -0.3046 -0.4461 -0.4468 -0.3159 -0.3118 -0.4074 -0.4087 -0.5123 -0.3113 -0.4425 0.8579 0.8306 0.5001 0.5816 -0.3731 0.0764 0.0704 0.2560 0.0555 0.0970 -0.3087 -0.2564 0.2090 0.1230 0.1458 0.1640 0.1827 0.1791 0.1903 0.1596 0.1778 0.1587 0.1155 0.1894 0.1909 0.1361 0.1725 0.2100 0.1463 0.1627 0.1157 0.1896 0.1365 0.1619 0.1889 0.1569 0.1897 0.1738 0.1245 0.1836
va: 4.7950 4.8150 4.7766 4.7908 4.7698 4.7715 4.7805 4.7977 4.7970 4.8079 4.7659 4.7875 4.7166 4.6590 4.5881 4.7289 4.7048 4.6240 4.7839 4.8094 4.7923 4.8152 4.7846 4.7906 4.7847 4.7889 2.2565 2.2749 2.2763 2.1037 2.1823 2.2044 2.2065 2.2759 2.2544 2.2787 2.2411 2.2261 2.2353 2.2492 2.2947 2.1698 2.2457 2.2977 2.2298 2.1487 2.1136 2.2522 2.2307 2.2327 2.2559 2.1505 2.2351 2.3031 2.2521 2.2661 2.2935 2.2874 2.2857 2.2708 2.2474 2.1353 2.2173 2.2448 2.2940 2.2556 2.2660 2.2795 2.2745 2.2972 2.2927 2.2864 2.2806 2.2220 2.2528 2.2376 2.2537 2.1993 2.2129 2.1187 2.2307 2.1472 2.1625 2.2519 2.2552 2.1485 2.2380 2.2480 2.2494 2.2265 2.1901 2.2975 2.2989 2.2550 2.2343 2.2550 3.5883 3.6429 4.6428 2.4030 2.2498 3.8793 0.9755 1.0108 1.0221 1.0061 2.0562 2.1359 0.9898 1.0337 1.0239 1.0151 1.0050 1.0067 1.0009 1.0190 1.0075 1.0196 1.0408 1.0015 0.9996 1.0324 1.0114 0.9890 1.0234 1.0163 1.0410 1.0011 1.0321 1.0175 1.0017 1.0205 1.0005 1.0104 1.0332 1.0043
dispcorr: -0.279242919 hartree
dipole: -86.62248 83.07856 -3.54392 34.21167 -36.16641 -1.95474 45.58764 -42.65798 2.92966
magnitude: 4.99633 au
magnitude: 12.69966 debye
