program: Orca
programVersion: 5.0.2
elementType: Si Si Si Si Si Si Si Si Si Si Si Si Si Si Si Si Si Si Si Si Si Si Si Si Si Si O O O O O O O O O O O O O O O O O O O O O O O O O O O O O O O O O O O O O O O O O O O O O O O O O O O O O O O O O O O O O O O O O O O O O O Al Al Co Cd O O C H H H H H H H H H H H H H H H H H H H H H H H H H H H H H H H H
elementType: Cd
charge: 0
multiplicity: 4
keywords: QMMM pbe d3bj def2-svp
formula: CH32Al2CdCoO72Si26
InChI: InChI=1S/CH3O.2Al.Cd.Co.H28O70Si26.HO/c1-2;;;;;1-71(2,3)37-81(23)53-87(29)43-75(11,12)39-73(7,8)41-83(25)45-77(15,16)47-85(27)59-86(28)48-78(17,18)46-84(26,58-94(36,61-86)63-93(35,57-83)60-85)42-74(9,10)40-76(13,14)44-88(30)54-82(24,38-72(4,5)6)56-90(32)50-80(21,22)52-92(34)62-91(33)51-79(19,20)49-89(31,55-81)66-95(64-87,68-91)70-96(65-88,67-90)69-92;/h1H3;;;;;1-2,4-5,7,9,11-28,31-34H;1H/q;+2;+3;;;-5;
135 atoms
Si -1.662907 13.008734 3.484006
Si 3.123438 15.77971 6.54016
Si 5.251538 9.13288 -1.545873
Si 5.301555 14.505405 1.597865
Si 1.588994 10.559712 11.534963
Si 3.715167 11.775386 -1.527421
Si -1.49993 10.507898 8.433592
Si 3.110066 15.812049 3.434699
Si -1.546238 13.08648 6.6027
Si 5.289088 14.486807 -1.525817
Si 3.142084 7.888394 11.522575
Si -1.548944 10.511538 11.565864
Si 3.0955 7.897514 8.409316
Si 5.370376 9.20501 1.55518
Si 5.300502 6.577329 6.603991
Si 1.563695 10.521309 8.420651
Si 3.849883 11.811137 1.581907
Si 1.527297 13.101105 6.610864
Si 1.539615 5.244474 8.432133
Si 8.408481 6.610362 6.548538
Si 3.616632 3.851525 3.488391
Si 8.382858 9.134322 -1.529886
Si 1.518341 5.200249 11.563866
Si 3.746171 3.9167 6.607992
Si 8.434073 6.577815 3.436517
Si 8.409461 9.135433 1.593021
O  -2.42532 11.555394 12.407863
O  2.477557 6.465683 11.914048
O  0.025435 10.697387 11.927283
O  5.044282 7.038905 5.062718
O  6.83134 14.803119 2.10906
O  -2.483558 9.317736 7.91059
O  2.676496 17.30048 2.923812
O  4.349228 13.226784 -1.89821
O  4.807219 10.644647 -1.929239
O  6.824816 8.958936 -1.916995
O  4.396936 8.046781 -2.383179
O  4.504591 8.080891 12.377689
O  3.577049 15.919572 4.989092
O  -2.593321 11.907036 2.770551
O  4.411445 15.471877 2.495971
O  1.936574 16.838182 6.916143
O  5.204118 14.933718 0.028586
O  -1.855173 11.801966 7.544927
O  2.432503 11.646532 12.38921
O  -1.979212 14.56357 3.092759
O  6.819797 14.000313 -1.919927
O  -1.909587 12.739401 5.079637
O  4.478617 15.982694 7.383643
O  4.817348 15.755748 -2.393578
O  2.064222 9.047201 11.870883
O  -1.885471 8.945794 11.917583
O  -2.515306 14.268768 7.146481
O  4.996867 8.838493 0.027337
O  1.90948 6.819629 8.224899
O  6.941823 6.065241 3.24276
O  4.39475 7.599878 7.488732
O  2.495032 14.344221 6.959988
O  6.858207 6.787773 6.990705
O  4.929964 5.028084 6.815774
O  4.424537 10.397685 2.134859
O  1.76794 12.605494 5.077027
O  2.564106 9.349682 7.896247
O  0.042718 10.016972 8.233586
O  4.164489 5.296099 3.08032
O  6.899992 9.713604 1.706112
O  1.941115 14.747869 3.248416
O  3.571281 7.944429 9.949369
O  0.002817 13.576869 6.800666
O  1.914366 11.836091 7.54631
O  3.342581 11.685765 0.050351
O  1.849268 10.895269 9.961832
O  -0.135981 12.78016 3.068554
O  4.997172 7.969883 2.503078
O  5.027937 12.911383 1.714415
O  8.735667 6.941619 4.99444
O  1.983212 3.920148 12.407619
O  0.015918 5.002634 7.907298
O  9.529583 5.475385 2.938154
O  8.727152 10.702773 -1.922142
O  9.270798 7.683587 7.382275
O  -0.005533 5.693451 11.916622
O  8.7320 5.051219 6.91434
O  2.196543 3.597028 2.775275
O  3.26605 3.769935 5.085691
O  4.809175 2.804988 3.09575
O  9.245673 8.087232 -2.392042
O  8.724825 8.831867 0.023879
O  1.63771 4.811172 9.984929
O  4.301499 2.493182 7.152106
O  9.440063 10.305107 2.103806
O  2.475421 4.276832 7.550061
O  8.779056 7.881393 2.500098
O  2.59365 12.069787 2.547303
O  2.346822 11.575611 -2.365349
O  -1.822711 10.813959 9.986826
Al 5.298437 6.500895 3.400392
Al 1.478568 13.118362 3.40523
Co 2.423819 10.859234 4.429608
Cd 4.119734 8.819996 4.556402
O  2.077706 8.984006 4.19592
O  4.211149 10.50181 5.558443
C  1.509432 8.439381 3.008588
H  1.684051 7.353994 3.000979
H  3.899379 10.338498 6.457511
H  1.958571 8.882766 2.112074
H  0.432886 8.643475 3.01954
H  -3.166628 11.694017 13.03834
H  7.716549 14.618565 1.776552
H  -2.840492 8.478032 8.244534
H  2.02556 17.945935 3.243736
H  3.649564 7.943736 -3.01513
H  4.939651 8.676711 13.02558
H  -3.237668 11.845843 2.056264
H  1.715396 17.748888 6.701361
H  3.169666 11.732555 13.030452
H  -2.627229 15.235822 3.315176
H  7.708955 14.280667 -1.696578
H  4.928668 16.557579 8.021715
H  5.074614 16.460051 -3.019527
H  -2.58759 8.323884 11.708359
H  -2.853916 15.114299 6.798759
H  1.732405 3.208882 13.038236
H  -0.889785 5.105278 8.243143
H  9.751305 4.583496 3.249801
H  9.411997 11.333486 -1.697514
H  9.99264 7.787031 8.021136
H  -0.896142 5.39582 11.707952
H  9.414046 4.407271 6.700599
H  1.825324 3.070686 2.058262
H  5.068445 1.906206 3.316441
H  9.982016 7.960841 -3.018877
H  4.856487 1.772794 6.801138
H  9.713451 11.168467 1.774331
H  1.88887 10.98402 -3.00759
exchangeener: -1249.583859436296 hartree
correlationener: -38.455498058438 hartree
xcener: -1288.039357494734 hartree
s2: 3.753939
chargesum: -0.0000000
charge: 0.794945 0.775735 0.835715 0.797935 0.833168 0.837807 0.813869 0.824827 0.805425 0.781673 0.834651 0.799676 0.900634 0.918419 0.988811 0.872148 0.917772 0.948038 0.810186 0.773705 0.792243 0.779076 0.800098 0.805053 0.820801 0.797360 -0.309062 -0.427706 -0.427235 -0.643421 -0.315482 -0.314650 -0.323445 -0.425684 -0.467696 -0.424796 -0.314344 -0.320647 -0.455856 -0.306821 -0.404580 -0.362501 -0.449879 -0.407855 -0.319458 -0.370489 -0.371490 -0.446675 -0.315868 -0.309419 -0.463916 -0.361703 -0.311745 -0.443900 -0.476518 -0.497918 -0.449652 -0.415313 -0.422154 -0.455830 -0.481533 -0.621738 -0.472879 -0.474716 -0.486024 -0.468720 -0.500164 -0.448640 -0.460059 -0.432211 -0.452756 -0.448554 -0.481935 -0.546849 -0.467681 -0.458097 -0.309105 -0.313874 -0.322273 -0.370157 -0.316125 -0.362438 -0.361980 -0.307473 -0.444434 -0.371144 -0.307751 -0.449155 -0.448040 -0.311112 -0.315373 -0.406267 -0.406365 -0.545356 -0.316989 -0.448255 0.854127 0.832482 0.517049 0.603400 -0.535385 -0.436340 0.134853 0.077514 0.212121 0.042637 0.068423 0.210638 0.122472 0.145496 0.161511 0.185969 0.178857 0.190248 0.160015 0.178037 0.156470 0.116625 0.190706 0.192849 0.135787 0.171297 0.210695 0.145593 0.161287 0.116108 0.190431 0.136615 0.160434 0.190263 0.157273 0.191906 0.171336 0.123056 0.187311
charge: 0.419457 0.434558 0.459678 0.452775 0.462201 0.463120 0.458185 0.448186 0.457602 0.437824 0.464133 0.447801 0.476223 0.469349 0.506361 0.461988 0.469957 0.488477 0.458163 0.432487 0.419068 0.436455 0.447978 0.458366 0.447108 0.450398 -0.160931 -0.240823 -0.240386 -0.214991 -0.184736 -0.178446 -0.183694 -0.238991 -0.257132 -0.238039 -0.173245 -0.178297 -0.257423 -0.159671 -0.227150 -0.191311 -0.257280 -0.228852 -0.177162 -0.192018 -0.209155 -0.249403 -0.167820 -0.165338 -0.254216 -0.195601 -0.172437 -0.237223 -0.253490 -0.264884 -0.241098 -0.232948 -0.235590 -0.244356 -0.237470 -0.239620 -0.249305 -0.254134 -0.253422 -0.249212 -0.263436 -0.246777 -0.246991 -0.242638 -0.242006 -0.245846 -0.255146 -0.228722 -0.249720 -0.258575 -0.160949 -0.177983 -0.183384 -0.207719 -0.168298 -0.196439 -0.191086 -0.159663 -0.249026 -0.192642 -0.163893 -0.256454 -0.254089 -0.171968 -0.184833 -0.228478 -0.227820 -0.243150 -0.175262 -0.254348 0.207989 0.174521 0.567570 0.260835 -0.216684 -0.185656 0.063975 0.039578 0.067325 0.018328 0.034811 0.125825 0.057212 0.076583 0.082953 0.109240 0.103011 0.101357 0.076957 0.102290 0.074126 0.047596 0.105553 0.111556 0.061643 0.092978 0.125923 0.076690 0.082504 0.047013 0.105313 0.062490 0.077519 0.101149 0.075102 0.110306 0.093091 0.057538 0.110635
qa: 0.7949 0.7757 0.8357 0.7979 0.8332 0.8378 0.8139 0.8248 0.8054 0.7817 0.8347 0.7997 0.9006 0.9184 0.9888 0.8721 0.9178 0.9480 0.8102 0.7737 0.7922 0.7791 0.8001 0.8051 0.8208 0.7974 -0.3091 -0.4277 -0.4272 -0.6434 -0.3155 -0.3147 -0.3234 -0.4257 -0.4677 -0.4248 -0.3143 -0.3206 -0.4559 -0.3068 -0.4046 -0.3625 -0.4499 -0.4079 -0.3195 -0.3705 -0.3715 -0.4467 -0.3159 -0.3094 -0.4639 -0.3617 -0.3117 -0.4439 -0.4765 -0.4979 -0.4497 -0.4153 -0.4222 -0.4558 -0.4815 -0.6217 -0.4729 -0.4747 -0.4860 -0.4687 -0.5002 -0.4486 -0.4601 -0.4322 -0.4528 -0.4486 -0.4819 -0.5468 -0.4677 -0.4581 -0.3091 -0.3139 -0.3223 -0.3702 -0.3161 -0.3624 -0.3620 -0.3075 -0.4444 -0.3711 -0.3078 -0.4492 -0.4480 -0.3111 -0.3154 -0.4063 -0.4064 -0.5454 -0.3170 -0.4483 0.8541 0.8325 0.5170 0.6034 -0.5354 -0.4363 0.1349 0.0775 0.2121 0.0426 0.0684 0.2106 0.1225 0.1455 0.1615 0.1860 0.1789 0.1902 0.1600 0.1780 0.1565 0.1166 0.1907 0.1928 0.1358 0.1713 0.2107 0.1456 0.1613 0.1161 0.1904 0.1366 0.1604 0.1903 0.1573 0.1919 0.1713 0.1231 0.1873
va: 4.7848 4.8162 4.7659 4.7964 4.7673 4.7633 4.7794 4.7609 4.7920 4.8037 4.7647 4.7836 4.6956 4.6710 4.5765 4.7361 4.6740 4.6328 4.7847 4.8197 4.7873 4.8069 4.7831 4.7917 4.7737 4.7976 2.2501 2.2730 2.2735 2.1097 2.1806 2.2028 2.2118 2.2742 2.2516 2.2753 2.2326 2.2194 2.2396 2.2493 2.3007 2.1656 2.2443 2.2977 2.2204 2.1516 2.1148 2.2520 2.2283 2.2327 2.2531 2.1471 2.2301 2.2868 2.2545 2.2733 2.2772 2.2954 2.2900 2.2744 2.2495 2.1644 2.2592 2.2540 2.2814 2.2605 2.2713 2.2765 2.2698 2.2883 2.2782 2.2760 2.2879 2.2100 2.2625 2.2378 2.2501 2.2036 2.2131 2.1162 2.2280 2.1469 2.1669 2.2487 2.2549 2.1521 2.2345 2.2453 2.2487 2.2310 2.1820 2.2992 2.2995 2.2279 2.2299 2.2491 3.6051 3.6212 4.8942 2.3188 2.1630 2.2265 3.8602 0.9929 1.0088 1.0031 0.9796 0.9886 1.0339 1.0239 1.0169 1.0029 1.0065 1.0011 1.0189 1.0070 1.0207 1.0405 1.0003 0.9984 1.0324 1.0116 0.9885 1.0239 1.0172 1.0408 1.0004 1.0320 1.0186 1.0011 1.0202 0.9991 1.0116 1.0336 1.0020
dispcorr: -0.272931255 hartree
dipole: -48.96840 45.95300 -3.01541 59.35628 -61.14515 -1.78887 29.11222 -26.90338 2.20885
magnitude: 4.14388 au
magnitude: 10.53291 debye
