program: Orca
programVersion: 5.0.2
elementType: Si Si Si Si Si Si Si Si Si Si Si Si Si Si Si Si Si Si Si Si Si Si Si Si Si Si O O O O O O O O O O O O O O O O O O O O O O O O O O O O O O O O O O O O O O O O O O O O O O O O O O O O O O O O O O O O O O O O O O O O O O Al Al Co Cd O O C H H H H H H H H H H H H H H H H H H H H H H H H H H H H H H H H
elementType: Cd
charge: 0
multiplicity: 2
keywords: QMMM pbe d3bj def2-svp
formula: CH32Al2CdCoO72Si26
InChI: InChI=1S/CH3O.2Al.Cd.Co.H28O70Si26.HO/c1-2;;;;;1-71(2,3)37-81(23)53-87(29)43-75(11,12)39-73(7,8)41-83(25)45-77(15,16)47-85(27)59-86(28)48-78(17,18)46-84(26,58-94(36,61-86)63-93(35,57-83)60-85)42-74(9,10)40-76(13,14)44-88(30)54-82(24,38-72(4,5)6)56-90(32)50-80(21,22)52-92(34)62-91(33)51-79(19,20)49-89(31,55-81)66-95(64-87,68-91)70-96(65-88,67-90)69-92;/h1H3;;;;;1-2,4-5,7,9,11-28,31-34H;1H/q;+2;+3;;;-5;
135 atoms
Si -1.673688 13.002343 3.497757
Si 3.127272 15.78298 6.537113
Si 5.257977 9.141274 -1.567491
Si 5.2938 14.500525 1.598174
Si 1.582344 10.558219 11.550302
Si 3.726036 11.772796 -1.545637
Si -1.509943 10.51402 8.44003
Si 3.116503 15.819252 3.432591
Si -1.540115 13.082409 6.588813
Si 5.290039 14.487625 -1.527014
Si 3.138512 7.883435 11.533949
Si -1.553237 10.512681 11.570457
Si 3.088041 7.883856 8.426803
Si 5.380277 9.215602 1.534921
Si 5.290873 6.598124 6.582094
Si 1.546325 10.531031 8.443564
Si 3.82346 11.803155 1.574024
Si 1.561376 13.084656 6.58165
Si 1.538396 5.234071 8.435061
Si 8.406663 6.61205 6.545702
Si 3.616384 3.851164 3.488246
Si 8.386904 9.13268 -1.533107
Si 1.517608 5.196039 11.566071
Si 3.747999 3.921733 6.599195
Si 8.444153 6.578931 3.43799
Si 8.416693 9.135062 1.590228
O  -2.427134 11.559633 12.410201
O  2.472599 6.461584 11.924916
O  0.018683 10.693134 11.941078
O  5.039763 7.085795 5.045599
O  6.827026 14.779459 2.111459
O  -2.497411 9.327289 7.915357
O  2.675554 17.303964 2.91842
O  4.351644 13.229462 -1.906543
O  4.82054 10.649374 -1.966506
O  6.831463 8.955244 -1.927042
O  4.401002 8.047099 -2.390836
O  4.500776 8.075546 12.38821
O  3.582853 15.930055 4.986773
O  -2.55712 11.893968 2.737041
O  4.417395 15.483101 2.493688
O  1.938359 16.83866 6.915159
O  5.203515 14.928254 0.028279
O  -1.84606 11.814251 7.553083
O  2.422882 11.64493 12.405633
O  -1.987418 14.554531 3.093632
O  6.820739 14.000615 -1.92089
O  -1.969628 12.725406 5.083065
O  4.482286 15.983685 7.381217
O  4.818304 15.759769 -2.389927
O  2.061996 9.045267 11.876733
O  -1.889157 8.94695 11.920588
O  -2.472852 14.286599 7.148101
O  4.996494 8.864198 0.008216
O  1.898418 6.811667 8.233727
O  6.950882 6.067636 3.248164
O  4.379634 7.587164 7.496635
O  2.497791 14.346928 6.950423
O  6.852066 6.795797 6.967935
O  4.925436 5.04381 6.773169
O  4.443271 10.406731 2.137369
O  1.898808 12.578339 5.062687
O  2.53344 9.337035 7.942293
O  0.030346 10.016944 8.246484
O  4.175991 5.295736 3.092825
O  6.909427 9.719779 1.703009
O  1.951759 14.749436 3.250413
O  3.573493 7.925357 9.962789
O  0.023528 13.547895 6.698015
O  1.892695 11.849279 7.574002
O  3.361948 11.655569 0.028459
O  1.834116 10.911177 9.981086
O  -0.12915 12.77716 3.152987
O  5.011076 7.958556 2.461609
O  4.990393 12.915473 1.726739
O  8.749293 6.944677 4.993521
O  1.985112 3.916229 12.408189
O  0.015472 4.986454 7.909706
O  9.53602 5.475592 2.935266
O  8.73009 10.7011 -1.924473
O  9.265273 7.682651 7.387177
O  -0.005735 5.690427 11.918057
O  8.730029 5.052488 6.910967
O  2.200548 3.603675 2.766475
O  3.255203 3.757463 5.082029
O  4.809079 2.804539 3.09427
O  9.249636 8.082326 -2.390112
O  8.727053 8.830817 0.021041
O  1.63856 4.802959 9.988425
O  4.316453 2.505856 7.15013
O  9.448061 10.30307 2.102708
O  2.482755 4.276997 7.551083
O  8.783647 7.882607 2.499192
O  2.517368 12.056779 2.465071
O  2.354031 11.578533 -2.378431
O  -1.831691 10.819704 9.993401
Al 5.309186 6.503245 3.395743
Al 1.499974 13.11943 3.409939
Co 2.342352 10.860312 4.414126
Cd 4.090594 8.821708 4.403512
O  2.111396 9.147683 3.964968
O  3.849871 10.32763 5.633841
C  1.452148 8.913951 2.725329
H  0.976317 7.927682 2.782377
H  3.482174 10.032752 6.480478
H  2.160686 8.938843 1.889852
H  0.685278 9.684488 2.572496
H  -3.167395 11.69581 13.039328
H  7.714725 14.60856 1.777567
H  -2.846349 8.482071 8.24655
H  2.025162 17.947408 3.241456
H  3.651283 7.943871 -3.018367
H  4.938038 8.674451 13.030029
H  -3.22236 11.840317 2.042095
H  1.716151 17.74909 6.700945
H  3.165597 11.731877 13.037397
H  -2.630698 15.2320 3.315545
H  7.709354 14.280795 -1.696985
H  4.93022 16.557998 8.020689
H  5.075018 16.461751 -3.017983
H  -2.589149 8.324373 11.70963
H  -2.835965 15.121839 6.799444
H  1.733208 3.207224 13.038477
H  -0.889973 5.098436 8.244161
H  9.754027 4.583583 3.24858
H  9.413239 11.332779 -1.6985
H  9.990304 7.786635 8.023209
H  -0.896228 5.394541 11.708559
H  9.413213 4.407807 6.699172
H  1.827018 3.073497 2.054541
H  5.068404 1.906016 3.315815
H  9.983692 7.958766 -3.018061
H  4.86281 1.778153 6.800302
H  9.716833 11.167605 1.773867
H  1.891918 10.985256 -3.013122
exchangeener: -1249.612158358510 hartree
correlationener: -38.474581633917 hartree
xcener: -1288.086739992427 hartree
s2: 1.381852
chargesum: 0.0000000
charge: 0.793112 0.773479 0.833831 0.797877 0.831812 0.832745 0.815734 0.824325 0.806110 0.780676 0.834092 0.796712 0.893376 0.924722 0.984376 0.871186 0.911361 0.960711 0.810822 0.775260 0.789943 0.777171 0.797958 0.804395 0.819497 0.796648 -0.307334 -0.427031 -0.426229 -0.643195 -0.316881 -0.315525 -0.322448 -0.424273 -0.466357 -0.423278 -0.312758 -0.318915 -0.456172 -0.307120 -0.404631 -0.362008 -0.449374 -0.407388 -0.316714 -0.370473 -0.371385 -0.447204 -0.315645 -0.308934 -0.464120 -0.360922 -0.312860 -0.446667 -0.474615 -0.497513 -0.443191 -0.414438 -0.423172 -0.458050 -0.490529 -0.620054 -0.488822 -0.472678 -0.483038 -0.464657 -0.498778 -0.447269 -0.463884 -0.422128 -0.449874 -0.444101 -0.487996 -0.550859 -0.467018 -0.458340 -0.307800 -0.314070 -0.321544 -0.369732 -0.316956 -0.361941 -0.362902 -0.304553 -0.444268 -0.373157 -0.305860 -0.448412 -0.447922 -0.312308 -0.314393 -0.406161 -0.405846 -0.529098 -0.315867 -0.447549 0.874003 0.816515 0.440176 0.629499 -0.520582 -0.432838 0.140093 0.076951 0.231000 0.046708 0.067170 0.209076 0.122252 0.146362 0.161119 0.185681 0.178116 0.190043 0.159484 0.176685 0.157319 0.116383 0.190194 0.192672 0.135174 0.171474 0.209479 0.145775 0.161579 0.116367 0.190643 0.136189 0.160954 0.189381 0.156929 0.191287 0.171302 0.122935 0.185706
charge: 0.417953 0.434132 0.458059 0.452224 0.460466 0.460341 0.457936 0.447367 0.458718 0.436953 0.463382 0.446054 0.476036 0.470764 0.509230 0.464997 0.471973 0.499571 0.457752 0.433719 0.420141 0.435381 0.446785 0.458381 0.446554 0.449296 -0.159381 -0.240246 -0.239458 -0.220420 -0.185828 -0.179014 -0.183001 -0.237978 -0.256641 -0.236831 -0.171873 -0.176805 -0.257769 -0.159505 -0.227159 -0.191302 -0.256770 -0.228556 -0.174898 -0.192273 -0.209022 -0.250701 -0.167569 -0.164831 -0.253939 -0.194749 -0.173597 -0.235828 -0.253674 -0.263838 -0.241216 -0.233105 -0.237057 -0.245248 -0.237310 -0.224798 -0.245802 -0.253514 -0.252774 -0.248369 -0.262015 -0.245061 -0.247614 -0.237816 -0.241640 -0.243124 -0.255592 -0.222493 -0.249278 -0.259089 -0.159779 -0.178243 -0.182711 -0.206989 -0.169090 -0.195864 -0.191878 -0.158680 -0.249338 -0.193520 -0.162160 -0.255749 -0.253841 -0.172684 -0.184105 -0.228610 -0.227437 -0.235308 -0.174242 -0.253900 0.212602 0.168961 0.420626 0.277048 -0.170538 -0.151080 0.068312 0.043529 0.056414 0.022445 0.033628 0.124023 0.057325 0.077424 0.082461 0.108619 0.102207 0.101127 0.076515 0.100873 0.074888 0.047255 0.105023 0.111263 0.061018 0.093456 0.124519 0.076826 0.082590 0.047136 0.105661 0.062065 0.078198 0.100421 0.074790 0.109360 0.093206 0.057229 0.108907
qa: 0.7931 0.7735 0.8338 0.7979 0.8318 0.8327 0.8157 0.8243 0.8061 0.7807 0.8341 0.7967 0.8934 0.9247 0.9844 0.8712 0.9114 0.9607 0.8108 0.7753 0.7899 0.7772 0.7980 0.8044 0.8195 0.7966 -0.3073 -0.4270 -0.4262 -0.6432 -0.3169 -0.3155 -0.3224 -0.4243 -0.4664 -0.4233 -0.3128 -0.3189 -0.4562 -0.3071 -0.4046 -0.3620 -0.4494 -0.4074 -0.3167 -0.3705 -0.3714 -0.4472 -0.3156 -0.3089 -0.4641 -0.3609 -0.3129 -0.4467 -0.4746 -0.4975 -0.4432 -0.4144 -0.4232 -0.4581 -0.4905 -0.6201 -0.4888 -0.4727 -0.4830 -0.4647 -0.4988 -0.4473 -0.4639 -0.4221 -0.4499 -0.4441 -0.4880 -0.5509 -0.4670 -0.4583 -0.3078 -0.3141 -0.3215 -0.3697 -0.3170 -0.3619 -0.3629 -0.3046 -0.4443 -0.3732 -0.3059 -0.4484 -0.4479 -0.3123 -0.3144 -0.4062 -0.4058 -0.5291 -0.3159 -0.4475 0.8740 0.8165 0.4402 0.6295 -0.5206 -0.4328 0.1401 0.0770 0.2310 0.0467 0.0672 0.2091 0.1223 0.1464 0.1611 0.1857 0.1781 0.1900 0.1595 0.1767 0.1573 0.1164 0.1902 0.1927 0.1352 0.1715 0.2095 0.1458 0.1616 0.1164 0.1906 0.1362 0.1610 0.1894 0.1569 0.1913 0.1713 0.1229 0.1857
va: 4.7896 4.8196 4.7690 4.7962 4.7688 4.7695 4.7770 4.7609 4.7907 4.8045 4.7654 4.7874 4.7074 4.6597 4.5847 4.7376 4.6850 4.6138 4.7840 4.8179 4.7914 4.8091 4.7859 4.7925 4.7758 4.7976 2.2515 2.2737 2.2746 2.1092 2.1783 2.2028 2.2129 2.2754 2.2531 2.2768 2.2350 2.2211 2.2392 2.2495 2.3007 2.1657 2.2448 2.2985 2.2229 2.1529 2.1149 2.2526 2.2283 2.2334 2.2534 2.1476 2.2287 2.2854 2.2553 2.2740 2.2835 2.2966 2.2874 2.2711 2.2411 2.1727 2.2406 2.2554 2.2850 2.2641 2.2731 2.2779 2.2658 2.2990 2.2797 2.2795 2.2806 2.2055 2.2626 2.2376 2.2511 2.2036 2.2146 2.1172 2.2267 2.1472 2.1659 2.2507 2.2543 2.1486 2.2369 2.2460 2.2489 2.2292 2.1834 2.2990 2.3000 2.2486 2.2307 2.2498 3.5748 3.6474 4.4079 2.2673 2.1831 2.2509 3.8532 0.9789 1.0023 1.0057 0.9995 0.9896 1.0339 1.0234 1.0172 1.0032 1.0069 1.0013 1.0191 1.0078 1.0204 1.0406 1.0006 0.9985 1.0328 1.0117 0.9893 1.0237 1.0171 1.0407 1.0003 1.0322 1.0183 1.0015 1.0204 0.9995 1.0117 1.0337 1.0031
dispcorr: -0.273684191 hartree
dipole: -47.49462 44.47755 -3.01707 60.64061 -62.40937 -1.76876 38.19268 -36.19096 2.00172
magnitude: 4.02965 au
magnitude: 10.24256 debye
