program: Orca
programVersion: 5.0.2
elementType: Si Si Si Si Si Si Si Si Si Si Si Si Si Si Si Si Si Si Si Si Si Si Si Si Si Si O O O O O O O O O O O O O O O O O O O O O O O O O O O O O O O O O O O O O O O O O O O O O O O O O O O O O O O O O O O O O O O O O O O O O O Al Al Cd Cd O C H H H H O O H H H H H H H H H H H H H H H H H H H H H H H H H H H H
elementType: Cd
charge: 0
multiplicity: 1
keywords: QMMM pbe d3bj def2-svp
formula: CH32Al2Cd2O73Si26
InChI: InChI=1S/CH4O.2Al.2Cd.H28O70Si26.O2/c1-2;;;;;1-71(2,3)37-81(23)53-87(29)43-75(11,12)39-73(7,8)41-83(25)45-77(15,16)47-85(27)59-86(28)48-78(17,18)46-84(26,58-94(36,61-86)63-93(35,57-83)60-85)42-74(9,10)40-76(13,14)44-88(30)54-82(24,38-72(4,5)6)56-90(32)50-80(21,22)52-92(34)62-91(33)51-79(19,20)49-89(31,55-81)66-95(64-87,68-91)70-96(65-88,67-90)69-92;1-2/h2H,1H3;;;;;1-2,4-5,7,9,11-28,31-34H;/q;2*+2;;;-4;
136 atoms
Si -1.675154 13.004458 3.493679
Si 3.126828 15.760973 6.549767
Si 5.260734 9.125973 -1.565463
Si 5.307219 14.480896 1.589751
Si 1.584081 10.561396 11.550375
Si 3.72214 11.791293 -1.565612
Si -1.510186 10.515852 8.439777
Si 3.100809 15.780606 3.446494
Si -1.5486 13.084641 6.596993
Si 5.291527 14.49091 -1.536402
Si 3.126625 7.889622 11.550443
Si -1.553903 10.512758 11.571413
Si 3.084168 7.887162 8.435032
Si 5.355181 9.209057 1.511946
Si 5.291386 6.601496 6.602721
Si 1.561246 10.525423 8.434788
Si 3.841207 11.831635 1.512034
Si 1.55108 13.07987 6.603337
Si 1.540182 5.232422 8.440255
Si 8.401083 6.625904 6.549724
Si 3.612564 3.845186 3.494045
Si 8.383373 9.135603 -1.536662
Si 1.515693 5.196297 11.571736
Si 3.745803 3.914903 6.596991
Si 8.405126 6.593657 3.446627
Si 8.382551 9.154061 1.589575
O  -2.428558 11.55962 12.408966
O  2.467113 6.463588 11.932289
O  0.019375 10.703273 11.932208
O  5.04074 7.143748 5.079228
O  6.828307 14.824475 2.091197
O  -2.47491 9.314165 7.907847
O  2.684935 17.282415 2.96272
O  4.367334 13.2328 -1.949026
O  4.811398 10.643326 -1.915913
O  6.831757 8.964278 -1.949029
O  4.413526 8.047098 -2.414491
O  4.491748 8.074762 12.398007
O  3.592957 15.836097 4.996902
O  -2.595981 11.904313 2.770321
O  4.384628 15.415254 2.493702
O  1.936124 16.827594 6.890837
O  5.190095 14.914476 0.022907
O  -1.862659 11.810891 7.552596
O  2.42698 11.651141 12.397934
O  -1.974788 14.561683 3.099617
O  6.822196 14.009265 -1.929743
O  -1.953764 12.736957 5.087232
O  4.480974 15.986969 7.383979
O  4.816744 15.774966 -2.378606
O  2.047929 9.048015 11.897979
O  -1.88691 8.946347 11.920076
O  -2.475407 14.289999 7.15869
O  5.023778 8.774395 -0.002873
O  1.898538 6.810045 8.224685
O  6.906769 6.081376 3.284092
O  4.389874 7.574563 7.537238
O  2.498569 14.333687 6.991697
O  6.850912 6.795352 6.991502
O  4.919115 5.048207 6.74824
O  4.33869 10.370518 2.008974
O  1.894063 12.592867 5.079123
O  2.48852 9.301984 7.880346
O  0.035405 10.038172 8.223837
O  4.160773 5.30041 3.130648
O  6.876055 9.742698 1.691751
O  1.907855 14.739384 3.283464
O  3.539159 7.950949 9.974261
O  0.019671 13.53339 6.749947
O  1.944476 11.811822 7.536319
O  3.299453 11.761582 -0.002892
O  1.843558 10.887651 9.974066
O  -0.141096 12.751152 3.129478
O  5.03112 8.010657 2.530442
O  5.06379 12.881874 1.691509
O  8.699934 6.99193 4.996932
O  1.98507 3.915589 12.409454
O  0.017137 4.997339 7.908175
O  9.497329 5.482209 2.962863
O  8.731894 10.701854 -1.930187
O  9.273589 7.68555 7.384293
O  -0.0075 5.691102 11.920056
O  8.729711 5.061435 6.890559
O  2.199562 3.598361 2.77014
O  3.241362 3.737045 5.087496
O  4.811307 2.80704 3.099881
O  9.257965 8.082307 -2.378729
O  8.699484 8.83619 0.02278
O  1.639003 4.806194 9.992989
O  4.326433 2.509675 7.158742
O  9.440408 10.299738 2.091168
O  2.486105 4.28051 7.552907
O  8.730629 7.887928 2.493569
O  2.640871 12.150386 2.529717
O  2.364215 11.596937 -2.414618
O  -1.829575 10.814574 9.992647
Al 5.260381 6.528856 3.430481
Al 1.472493 13.089659 3.429975
Cd 3.683985 11.713739 4.598676
Cd 5.176371 9.133287 4.595928
O  2.763094 9.462293 5.066931
C  1.607387 8.799438 4.513411
H  1.592485 7.751254 4.827637
H  2.694758 9.420761 6.051518
H  0.694281 9.307129 4.83913
H  1.695082 8.858246 3.426303
O  5.03752 10.769054 5.86195
O  5.635458 11.122881 4.46176
H  -3.167997 11.695804 13.038806
H  7.715266 14.627595 1.768999
H  -2.836835 8.476522 8.243375
H  2.029128 17.938297 3.260189
H  3.656579 7.94387 -3.02837
H  4.934221 8.674119 13.034172
H  -3.238792 11.844692 2.056167
H  1.715206 17.744411 6.69066
H  3.16733 11.734504 13.034141
H  -2.625358 15.235024 3.318076
H  7.70997 14.284453 -1.700728
H  4.929665 16.559387 8.021857
H  5.074358 16.468177 -3.013196
H  -2.588199 8.324118 11.709413
H  -2.837045 15.123277 6.803922
H  1.73319 3.206954 13.039012
H  -0.889269 5.103039 8.243513
H  9.737666 4.586381 3.260249
H  9.414002 11.333098 -1.700916
H  9.99382 7.787861 8.02199
H  -0.896974 5.394827 11.709405
H  9.413079 4.411591 6.690542
H  1.826601 3.07125 2.056091
H  5.069347 1.907073 3.318187
H  9.987214 7.958758 -3.013248
H  4.86703 1.779768 6.803944
H  9.713597 11.166197 1.768987
H  1.896225 10.993038 -3.028424
exchangeener: -1214.500685979166 hartree
correlationener: -38.406137962679 hartree
xcener: -1252.906823941844 hartree
chargesum: 0.0000000
charge: 0.789220 0.792896 0.831531 0.812769 0.834198 0.831319 0.808678 0.831134 0.802618 0.776098 0.834067 0.798024 0.886471 0.920410 0.991691 0.886208 0.920097 0.991979 0.808688 0.792822 0.789376 0.776090 0.798013 0.802804 0.830917 0.812566 -0.306021 -0.425984 -0.426086 -0.643252 -0.313579 -0.316081 -0.323033 -0.424111 -0.468595 -0.424182 -0.308286 -0.315683 -0.466293 -0.301644 -0.415277 -0.362311 -0.445427 -0.406730 -0.315774 -0.372759 -0.369281 -0.443265 -0.311292 -0.307141 -0.463614 -0.361106 -0.311286 -0.431322 -0.477062 -0.505948 -0.431855 -0.430833 -0.430763 -0.453707 -0.471167 -0.643350 -0.497113 -0.476976 -0.473486 -0.487039 -0.506149 -0.444316 -0.453582 -0.432045 -0.431398 -0.444254 -0.473407 -0.542095 -0.486991 -0.466183 -0.305961 -0.316103 -0.322937 -0.369255 -0.311264 -0.361156 -0.362309 -0.301663 -0.443380 -0.372769 -0.307146 -0.445281 -0.446267 -0.311327 -0.313597 -0.406792 -0.415266 -0.542129 -0.308277 -0.446140 0.845471 0.845839 0.547844 0.547520 -0.360981 0.096450 0.063611 0.244318 0.063248 0.075393 -0.368176 -0.342724 0.209813 0.124188 0.146157 0.163976 0.183035 0.178934 0.189521 0.161770 0.178974 0.157605 0.115688 0.189307 0.191090 0.136369 0.172456 0.209781 0.146116 0.163960 0.115699 0.189275 0.136368 0.161699 0.189540 0.157569 0.191131 0.172424 0.124193 0.183021
charge: 0.419191 0.433549 0.456508 0.455365 0.463176 0.456419 0.455238 0.446085 0.458430 0.434393 0.463092 0.446812 0.471488 0.464793 0.505272 0.471445 0.464690 0.505276 0.455284 0.433488 0.419286 0.434368 0.446802 0.458511 0.445948 0.455239 -0.157961 -0.239262 -0.239335 -0.210933 -0.180720 -0.179587 -0.185108 -0.237505 -0.255217 -0.237513 -0.168483 -0.173562 -0.257336 -0.156432 -0.228232 -0.192534 -0.256183 -0.229360 -0.173636 -0.192495 -0.206924 -0.249594 -0.162900 -0.163300 -0.253540 -0.194686 -0.171548 -0.231452 -0.258199 -0.267437 -0.233828 -0.233783 -0.233767 -0.243011 -0.220837 -0.210708 -0.245850 -0.258102 -0.249851 -0.244139 -0.267560 -0.241379 -0.243010 -0.233847 -0.231540 -0.241388 -0.249830 -0.224923 -0.244195 -0.257309 -0.157912 -0.179656 -0.185073 -0.206891 -0.162896 -0.194727 -0.192519 -0.156440 -0.249676 -0.192485 -0.163300 -0.256134 -0.252894 -0.171566 -0.180722 -0.229377 -0.228215 -0.225291 -0.168478 -0.252844 0.213111 0.213076 0.283369 0.283106 -0.025521 0.080596 0.029544 0.083428 0.029404 0.041610 -0.207100 -0.174581 0.124552 0.059083 0.077181 0.086384 0.106193 0.102601 0.100579 0.079585 0.102635 0.075277 0.046606 0.104951 0.109365 0.062040 0.094053 0.124523 0.077145 0.086384 0.046614 0.104926 0.062027 0.079525 0.100595 0.075227 0.109403 0.094017 0.059069 0.106189
qa: 0.7892 0.7929 0.8315 0.8128 0.8342 0.8313 0.8087 0.8311 0.8026 0.7761 0.8341 0.7980 0.8865 0.9204 0.9917 0.8862 0.9201 0.9920 0.8087 0.7928 0.7894 0.7761 0.7980 0.8028 0.8309 0.8126 -0.3060 -0.4260 -0.4261 -0.6433 -0.3136 -0.3161 -0.3230 -0.4241 -0.4686 -0.4242 -0.3083 -0.3157 -0.4663 -0.3016 -0.4153 -0.3623 -0.4454 -0.4067 -0.3158 -0.3728 -0.3693 -0.4433 -0.3113 -0.3071 -0.4636 -0.3611 -0.3113 -0.4313 -0.4771 -0.5059 -0.4319 -0.4308 -0.4308 -0.4537 -0.4712 -0.6434 -0.4971 -0.4770 -0.4735 -0.4870 -0.5061 -0.4443 -0.4536 -0.4320 -0.4314 -0.4443 -0.4734 -0.5421 -0.4870 -0.4662 -0.3060 -0.3161 -0.3229 -0.3693 -0.3113 -0.3612 -0.3623 -0.3017 -0.4434 -0.3728 -0.3071 -0.4453 -0.4463 -0.3113 -0.3136 -0.4068 -0.4153 -0.5421 -0.3083 -0.4461 0.8455 0.8458 0.5478 0.5475 -0.3610 0.0965 0.0636 0.2443 0.0632 0.0754 -0.3682 -0.3427 0.2098 0.1242 0.1462 0.1640 0.1830 0.1789 0.1895 0.1618 0.1790 0.1576 0.1157 0.1893 0.1911 0.1364 0.1725 0.2098 0.1461 0.1640 0.1157 0.1893 0.1364 0.1617 0.1895 0.1576 0.1911 0.1724 0.1242 0.1830
va: 4.7902 4.7944 4.7702 4.7807 4.7654 4.7705 4.7864 4.7719 4.7936 4.8108 4.7656 4.7855 4.7157 4.6804 4.5750 4.7161 4.6808 4.5747 4.7864 4.7945 4.7900 4.8108 4.7856 4.7934 4.7722 4.7809 2.2539 2.2749 2.2747 2.1121 2.1889 2.2020 2.2149 2.2762 2.2520 2.2760 2.2373 2.2265 2.2318 2.2542 2.2946 2.1686 2.2495 2.2982 2.2265 2.1501 2.1170 2.2550 2.2377 2.2351 2.2545 2.1487 2.2320 2.2986 2.2525 2.2653 2.2962 2.2831 2.2831 2.2780 2.2684 2.1122 2.2313 2.2526 2.2957 2.2488 2.2651 2.2809 2.2781 2.2961 2.2985 2.2810 2.2958 2.2119 2.2490 2.2319 2.2540 2.2019 2.2149 2.1171 2.2377 2.1487 2.1685 2.2541 2.2549 2.1501 2.2351 2.2497 2.2504 2.2319 2.1888 2.2981 2.2946 2.2117 2.2373 2.2507 3.6054 3.6047 2.3988 2.3996 2.2489 3.8800 0.9894 1.0153 0.9897 0.9915 1.8651 2.0476 0.9892 1.0334 1.0235 1.0155 1.0046 1.0067 1.0014 1.0176 1.0067 1.0201 1.0409 1.0015 0.9995 1.0322 1.0112 0.9892 1.0235 1.0155 1.0409 1.0015 1.0322 1.0177 1.0014 1.0202 0.9995 1.0112 1.0334 1.0046
dispcorr: -0.282457478 hartree
dipole: -132.41135 129.02324 -3.38811 -76.44923 74.49641 -1.95282 54.14564 -51.41887 2.72677
magnitude: 4.76740 au
magnitude: 12.11776 debye
