program: Orca
programVersion: 5.0.2
elementType: Si Si Si Si Si Si Si Si Si Si Si Si Si Si Si Si Si Si Si Si Si Si Si Si Si Si O O O O O O O O O O O O O O O O O O O O O O O O O O O O O O O O O O O O O O O O O O O O O O O O O O O O O O O O O O O O O O O O O O O O O O Al Al Cd Cd O C H H H H O O H H H H H H H H H H H H H H H H H H H H H H H H H H H H
elementType: Cd
charge: 0
multiplicity: 1
keywords: QMMM pbe d3bj def2-svp
formula: CH32Al2Cd2O73Si26
InChI: InChI=1S/CH3O.2Al.2Cd.H28O70Si26.HO2/c1-2;;;;;1-71(2,3)37-81(23)53-87(29)43-75(11,12)39-73(7,8)41-83(25)45-77(15,16)47-85(27)59-86(28)48-78(17,18)46-84(26,58-94(36,61-86)63-93(35,57-83)60-85)42-74(9,10)40-76(13,14)44-88(30)54-82(24,38-72(4,5)6)56-90(32)50-80(21,22)52-92(34)62-91(33)51-79(19,20)49-89(31,55-81)66-95(64-87,68-91)70-96(65-88,67-90)69-92;1-2/h1H3;;;;;1-2,4-5,7,9,11-28,31-34H;1H/q;2*+2;;;-4;
136 atoms
Si -1.667397 13.010108 3.486952
Si 3.114601 15.773611 6.554222
Si 5.248889 9.130225 -1.536939
Si 5.303754 14.493959 1.597195
Si 1.600645 10.585731 11.496546
Si 3.718374 11.779251 -1.534509
Si -1.516011 10.515627 8.437055
Si 3.102887 15.819555 3.424557
Si -1.559092 13.091738 6.620951
Si 5.288181 14.487636 -1.527671
Si 3.153693 7.892369 11.498274
Si -1.545103 10.509132 11.56691
Si 3.096963 7.881176 8.399501
Si 5.350901 9.213299 1.567644
Si 5.320404 6.540048 6.621635
Si 1.565019 10.541833 8.397854
Si 3.84453 11.824518 1.571193
Si 1.509537 13.138865 6.628326
Si 1.536621 5.228132 8.437484
Si 8.407582 6.609917 6.552903
Si 3.619343 3.848299 3.488321
Si 8.379413 9.133992 -1.528603
Si 1.516711 5.205971 11.56754
Si 3.747574 3.903902 6.619096
Si 8.443859 6.576214 3.424831
Si 8.393663 9.143035 1.595877
O  -2.412224 11.549021 12.422506
O  2.471915 6.480422 11.900604
O  0.036467 10.700892 11.897276
O  5.120741 6.947022 5.053424
O  6.831955 14.810671 2.109117
O  -2.471909 9.308225 7.904656
O  2.731987 17.339934 2.960283
O  4.355671 13.228615 -1.915747
O  4.810355 10.643626 -1.919994
O  6.822902 8.956888 -1.916638
O  4.401313 8.047694 -2.385807
O  4.506271 8.086599 12.368927
O  3.543854 15.856347 4.994889
O  -2.637602 11.922323 2.808757
O  4.410352 15.450508 2.508362
O  1.933786 16.839023 6.922381
O  5.200396 14.926678 0.030253
O  -1.890832 11.806211 7.553387
O  2.444991 11.659356 12.368107
O  -1.96718 14.57085 3.106418
O  6.819996 14.006243 -1.923531
O  -1.884378 12.748397 5.091413
O  4.486594 15.98855 7.370317
O  4.816668 15.765643 -2.383036
O  2.083857 9.070142 11.805466
O  -1.879419 8.942361 11.916294
O  -2.53427 14.270123 7.157351
O  5.007371 8.830349 0.03584
O  1.906063 6.802578 8.223225
O  6.974045 6.014985 3.188813
O  4.357405 7.581224 7.42412
O  2.49096 14.354321 7.046237
O  6.864748 6.7823 7.037488
O  4.944306 4.997896 6.864078
O  4.386546 10.396198 2.121281
O  1.754919 12.770959 5.057043
O  2.506715 9.312519 7.910427
O  0.03389 10.054702 8.221876
O  4.166942 5.28788 3.060998
O  6.885667 9.721051 1.713203
O  1.881433 14.829044 3.184733
O  3.60512 7.916237 9.928876
O  -0.013748 13.578174 6.879556
O  1.941987 11.77654 7.414324
O  3.340702 11.719454 0.039051
O  1.848303 10.965712 9.927172
O  -0.149296 12.763222 3.053007
O  5.027334 7.962026 2.522629
O  5.05401 12.898178 1.713744
O  8.699655 6.940317 4.994309
O  1.983746 3.934582 12.422405
O  0.01357 4.998338 7.905906
O  9.572897 5.493694 2.958452
O  8.729078 10.700935 -1.925029
O  9.276415 7.69204 7.37165
O  -0.00745 5.699639 11.916599
O  8.739579 5.05506 6.923075
O  2.193736 3.558921 2.804434
O  3.281081 3.78832 5.091434
O  4.819855 2.808299 3.104924
O  9.250122 8.086289 -2.383515
O  8.71665 8.838153 0.029189
O  1.633312 4.801855 9.991251
O  4.28236 2.47138 7.156656
O  9.429248 10.309975 2.109502
O  2.471517 4.262093 7.554556
O  8.777813 7.892099 2.50741
O  2.606141 12.171527 2.532541
O  2.356801 11.585085 -2.382965
O  -1.838186 10.811686 9.990605
Al 5.339161 6.4588 3.360828
Al 1.450414 13.189977 3.359503
Cd 2.717638 11.051382 4.621219
Cd 4.071645 8.609554 4.573955
O  2.096488 9.11323 4.317227
C  0.992207 8.487007 4.998989
H  0.935394 7.440447 4.670027
H  5.689213 10.973901 6.550664
H  1.101571 8.518646 6.088041
H  0.070801 9.011774 4.71119
O  4.819575 10.577164 6.388599
O  4.753158 10.580722 4.928303
H  -3.161091 11.691323 13.044531
H  7.716809 14.621758 1.776577
H  -2.835566 8.47401 8.242025
H  2.049024 17.962619 3.259158
H  3.651415 7.944122 -3.016241
H  4.940362 8.679125 13.021876
H  -3.256392 11.852307 2.07242
H  1.714218 17.749244 6.703999
H  3.174946 11.737977 13.021528
H  -2.622141 15.238901 3.320951
H  7.709039 14.283175 -1.698102
H  4.932041 16.560055 8.01608
H  5.074326 16.464235 -3.015069
H  -2.585031 8.322433 11.707814
H  -2.861935 15.114872 6.803356
H  1.732631 3.214985 13.044489
H  -0.890777 5.103461 8.242554
H  9.76962 4.591237 3.258384
H  9.412811 11.332709 -1.698735
H  9.995015 7.790605 8.016644
H  -0.896953 5.398437 11.707943
H  9.417251 4.408895 6.704292
H  1.824137 3.054572 2.070592
H  5.072961 1.907606 3.32032
H  9.983897 7.960442 -3.015272
H  4.848394 1.763575 6.803062
H  9.708878 11.170525 1.776739
H  1.89309 10.988027 -3.015039
exchangeener: -1214.466237342411 hartree
correlationener: -38.400898946069 hartree
xcener: -1252.867136288480 hartree
chargesum: -0.0000000
charge: 0.793818 0.773277 0.836050 0.797142 0.839341 0.836687 0.806257 0.825959 0.803573 0.780873 0.838941 0.801841 0.914238 0.932958 0.985107 0.916139 0.931774 0.988597 0.806357 0.772061 0.793938 0.780555 0.801718 0.803480 0.825643 0.796732 -0.309228 -0.429506 -0.429574 -0.645834 -0.318501 -0.315141 -0.322915 -0.425976 -0.468003 -0.425803 -0.315069 -0.321345 -0.458923 -0.303286 -0.408224 -0.359944 -0.450792 -0.405828 -0.321330 -0.371218 -0.370966 -0.446203 -0.318956 -0.310054 -0.465438 -0.362148 -0.307208 -0.443902 -0.483419 -0.495361 -0.453506 -0.421158 -0.421931 -0.454743 -0.474075 -0.646130 -0.453799 -0.483259 -0.483243 -0.473524 -0.495672 -0.446304 -0.453681 -0.458353 -0.444593 -0.446723 -0.482629 -0.551978 -0.474489 -0.458685 -0.309224 -0.314937 -0.322466 -0.370832 -0.319881 -0.362089 -0.359978 -0.302847 -0.446232 -0.371332 -0.309744 -0.450464 -0.447278 -0.307513 -0.318722 -0.405799 -0.407938 -0.550452 -0.315428 -0.447056 0.882356 0.881166 0.568523 0.568124 -0.569866 0.126986 0.064203 0.202214 0.035025 0.065031 -0.100893 -0.415889 0.211675 0.121635 0.145078 0.161458 0.186263 0.179332 0.191410 0.160648 0.179465 0.155814 0.115414 0.190956 0.192080 0.136970 0.170272 0.211612 0.145162 0.161398 0.115447 0.191081 0.136862 0.160884 0.191243 0.156067 0.191979 0.170252 0.121829 0.186452
charge: 0.421373 0.432564 0.460545 0.452416 0.466879 0.461106 0.453772 0.450016 0.456826 0.437490 0.466429 0.449596 0.476047 0.485257 0.506347 0.477559 0.484744 0.507304 0.453988 0.432288 0.421064 0.437385 0.449500 0.456649 0.449889 0.452083 -0.160980 -0.241911 -0.241967 -0.208797 -0.187819 -0.178237 -0.184540 -0.239326 -0.256752 -0.239144 -0.173857 -0.179054 -0.258223 -0.157235 -0.228379 -0.189284 -0.257669 -0.228076 -0.179008 -0.191506 -0.208852 -0.248753 -0.171057 -0.166056 -0.254616 -0.196247 -0.169048 -0.237239 -0.257363 -0.262877 -0.236402 -0.236462 -0.237269 -0.244857 -0.225979 -0.207987 -0.234516 -0.257041 -0.250047 -0.251392 -0.263295 -0.247144 -0.244553 -0.236637 -0.237713 -0.247246 -0.250120 -0.230896 -0.252024 -0.258472 -0.160984 -0.178231 -0.184130 -0.208738 -0.171759 -0.196191 -0.189189 -0.156902 -0.248816 -0.191498 -0.165759 -0.257408 -0.254042 -0.169320 -0.187969 -0.228021 -0.228309 -0.232085 -0.174130 -0.254018 0.215632 0.217064 0.308410 0.307154 -0.212220 0.071852 0.033912 0.090743 0.012308 0.033810 -0.021370 -0.168891 0.126968 0.056370 0.075951 0.082722 0.109841 0.103783 0.102471 0.077621 0.103883 0.073659 0.046672 0.105623 0.110824 0.062773 0.091497 0.126906 0.076032 0.082602 0.046687 0.105538 0.062660 0.077830 0.102284 0.073942 0.110665 0.091534 0.056521 0.110044
qa: 0.7938 0.7733 0.8360 0.7971 0.8393 0.8367 0.8063 0.8260 0.8036 0.7809 0.8389 0.8018 0.9142 0.9330 0.9851 0.9161 0.9318 0.9886 0.8064 0.7721 0.7939 0.7806 0.8017 0.8035 0.8256 0.7967 -0.3092 -0.4295 -0.4296 -0.6458 -0.3185 -0.3151 -0.3229 -0.4260 -0.4680 -0.4258 -0.3151 -0.3213 -0.4589 -0.3033 -0.4082 -0.3599 -0.4508 -0.4058 -0.3213 -0.3712 -0.3710 -0.4462 -0.3190 -0.3101 -0.4654 -0.3621 -0.3072 -0.4439 -0.4834 -0.4954 -0.4535 -0.4212 -0.4219 -0.4547 -0.4741 -0.6461 -0.4538 -0.4833 -0.4832 -0.4735 -0.4957 -0.4463 -0.4537 -0.4584 -0.4446 -0.4467 -0.4826 -0.5520 -0.4745 -0.4587 -0.3092 -0.3149 -0.3225 -0.3708 -0.3199 -0.3621 -0.3600 -0.3028 -0.4462 -0.3713 -0.3097 -0.4505 -0.4473 -0.3075 -0.3187 -0.4058 -0.4079 -0.5505 -0.3154 -0.4471 0.8824 0.8812 0.5685 0.5681 -0.5699 0.1270 0.0642 0.2022 0.0350 0.0650 -0.1009 -0.4159 0.2117 0.1216 0.1451 0.1615 0.1863 0.1793 0.1914 0.1606 0.1795 0.1558 0.1154 0.1910 0.1921 0.1370 0.1703 0.2116 0.1452 0.1614 0.1154 0.1911 0.1369 0.1609 0.1912 0.1561 0.1920 0.1703 0.1218 0.1865
va: 4.7843 4.8205 4.7652 4.7991 4.7576 4.7644 4.7913 4.7677 4.7936 4.8050 4.7581 4.7810 4.6783 4.6595 4.5873 4.6762 4.6615 4.5838 4.7910 4.8221 4.7840 4.8053 4.7813 4.7939 4.7677 4.7996 2.2504 2.2715 2.2712 2.1071 2.1765 2.2024 2.2126 2.2741 2.2515 2.2741 2.2314 2.2182 2.2367 2.2549 2.2980 2.1697 2.2437 2.3006 2.2183 2.1511 2.1142 2.2521 2.2258 2.2314 2.2511 2.1476 2.2358 2.2860 2.2470 2.2784 2.2805 2.2934 2.2923 2.2771 2.2642 2.1067 2.2777 2.2469 2.2869 2.2546 2.2780 2.2784 2.2782 2.2765 2.2851 2.2783 2.2876 2.2032 2.2535 2.2369 2.2504 2.2027 2.2131 2.1144 2.2247 2.1476 2.1698 2.2554 2.2521 2.1512 2.2318 2.2441 2.2499 2.2352 2.1764 2.3005 2.2981 2.2051 2.2311 2.2502 3.5554 3.5586 2.3999 2.3903 2.0980 3.8691 0.9750 0.9793 1.0342 0.9760 2.1047 1.9371 0.9879 1.0340 1.0242 1.0172 1.0026 1.0061 1.0004 1.0186 1.0060 1.0211 1.0410 1.0001 0.9988 1.0319 1.0124 0.9880 1.0242 1.0172 1.0410 1.0000 1.0320 1.0185 1.0005 1.0210 0.9989 1.0124 1.0339 1.0024
dispcorr: -0.279940637 hartree
dipole: -2.67734 -0.11677 -2.79411 -2.20127 0.54796 -1.65331 57.51234 -54.19914 3.31319
magnitude: 4.63872 au
magnitude: 11.79069 debye
