program: Orca
programVersion: 5.0.2
elementType: Si Si Si Si Si Si Si Si Si Si Si Si Si Si Si Si Si Si Si Si Si Si Si Si Si Si O O O O O O O O O O O O O O O O O O O O O O O O O O O O O O O O O O O O O O O O O O O O O O O O O O O O O O O O O O O O O O O O O O O O O O Al Al Cd Cd H H H H H H H H H H H H H H H H H H H H H H H H H H H H
elementType: Cd
charge: 0
multiplicity: 3
keywords: QMMM pbe d3bj def2-svp
formula: H28Al2Cd2O70Si26
InChI: InChI=1S/2Al.2Cd.H28O70Si26/c;;;;1-71(2,3)37-81(23)53-87(29)43-75(11,12)39-73(7,8)41-83(25)45-77(15,16)47-85(27)59-86(28)48-78(17,18)46-84(26,58-94(36,61-86)63-93(35,57-83)60-85)42-74(9,10)40-76(13,14)44-88(30)54-82(24,38-72(4,5)6)56-90(32)50-80(21,22)52-92(34)62-91(33)51-79(19,20)49-89(31,55-81)66-95(64-87,68-91)70-96(65-88,67-90)69-92/h;;;;1-2,4-5,7,9,11-28,31-34H/q2*+3;;;-6
128 atoms
Si -1.65959 12.997247 3.513474
Si 3.135303 15.797251 6.537339
Si 5.257165 9.122285 -1.551059
Si 5.284445 14.500852 1.580507
Si 1.566642 10.539747 11.583022
Si 3.716326 11.790261 -1.55047
Si -1.484052 10.504916 8.418781
Si 3.100697 15.788733 3.431559
Si -1.530079 13.084047 6.618989
Si 5.288268 14.491197 -1.537019
Si 3.09864 7.885484 11.583773
Si -1.547417 10.50364 11.581105
Si 3.085342 7.892503 8.417142
Si 5.326018 9.160451 1.535874
Si 5.337576 6.597857 6.648846
Si 1.566086 10.523478 8.416399
Si 3.782568 11.829808 1.537051
Si 1.570649 13.123245 6.650093
Si 1.544007 5.260454 8.419245
Si 8.436792 6.61507 6.537017
Si 3.614002 3.862249 3.514109
Si 8.38221 9.132457 -1.537349
Si 1.510938 5.206472 11.581659
Si 3.75421 3.93085 6.619037
Si 8.410271 6.588884 3.432717
Si 8.388298 9.124607 1.579798
O  -2.460042 11.555024 12.369223
O  2.463957 6.45398 11.992167
O  0.009587 10.705818 11.991297
O  4.982332 7.094334 5.156689
O  6.818574 14.794436 2.099014
O  -2.448137 9.295816 7.890039
O  2.644483 17.271794 2.921052
O  4.371626 13.23225 -1.945903
O  4.800353 10.637481 -1.906267
O  6.833576 8.968807 -1.946499
O  4.422519 8.044927 -2.425178
O  4.490026 8.086925 12.382496
O  3.577354 15.923013 4.990327
O  -2.573054 11.89403 2.769621
O  4.393928 15.475574 2.486831
O  1.941396 16.844283 6.926428
O  5.202464 14.949694 0.013889
O  -1.885091 11.813738 7.572201
O  2.437001 11.643803 12.381909
O  -1.972744 14.551089 3.149468
O  6.822478 14.017356 -1.937586
O  -1.883871 12.634636 5.109526
O  4.496074 15.990324 7.373473
O  4.80756 15.769378 -2.391168
O  2.024982 9.035085 11.971189
O  -1.884357 8.938529 11.925309
O  -2.514743 14.264929 7.123708
O  5.028813 8.738261 -0.00473
O  1.920875 6.809793 8.05402
O  6.896617 6.104707 3.326241
O  4.466711 7.521352 7.674477
O  2.505395 14.376348 7.014095
O  6.890551 6.779841 7.011284
O  4.935618 5.031137 6.818788
O  4.413291 10.413406 1.962472
O  1.822853 12.572922 5.155966
O  2.503912 9.31068 7.858284
O  0.046116 10.056341 8.054411
O  4.149024 5.337211 3.203193
O  6.873141 9.643579 1.700295
O  1.925815 14.719044 3.32033
O  3.417017 7.935826 9.987638
O  0.013036 13.557954 6.821151
O  1.935821 11.903898 7.67129
O  3.269498 11.784703 -0.004076
O  1.769992 10.790012 9.986818
O  -0.114931 12.724154 3.20017
O  4.902212 7.956638 2.485139
O  4.972364 12.930243 1.702946
O  8.76817 6.936132 4.990518
O  1.965406 3.890119 12.369148
O  0.014808 5.030918 7.889894
O  9.466099 5.452217 2.921296
O  8.739243 10.697937 -1.937952
O  9.283264 7.696548 7.374684
O  -0.013035 5.696892 11.925562
O  8.746381 5.057527 6.925962
O  2.202293 3.623035 2.769388
O  3.186655 3.847411 5.110166
O  4.803301 2.81451 3.149947
O  9.248536 8.07689 -2.391561
O  8.736535 8.828426 0.013474
O  1.642215 4.89598 9.981719
O  4.285443 2.48826 7.124374
O  9.411168 10.305187 2.098434
O  2.476784 4.258629 7.572721
O  8.783286 7.865205 2.48655
O  2.527539 12.060127 2.487118
O  2.36588 11.605786 -2.424399
O  -1.750838 10.772548 9.981301
Al 5.272095 6.61654 3.477479
Al 1.554199 13.05774 3.475577
Cd 0.567252 10.566346 4.855161
Cd 2.615144 6.996984 4.866947
H  -3.18131 11.693861 13.022001
H  7.711151 14.614893 1.772305
H  -2.825514 8.468763 8.235844
H  2.012024 17.933805 3.24257
H  3.660382 7.942952 -3.032889
H  4.933493 8.679262 13.027613
H  -3.229098 11.840343 2.055871
H  1.717435 17.751468 6.70571
H  3.171567 11.731401 13.027365
H  -2.624493 15.230545 3.339155
H  7.710089 14.287874 -1.704045
H  4.93605 16.560805 8.017414
H  5.070475 16.465814 -3.018508
H  -2.587119 8.320812 11.711626
H  -2.853678 15.112676 6.78913
H  1.724875 3.196184 13.021969
H  -0.890254 5.117238 8.235783
H  9.724461 4.573699 3.242672
H  9.417109 11.331441 -1.704199
H  9.997911 7.792512 8.017927
H  -0.899315 5.397275 11.711733
H  9.420127 4.409938 6.705513
H  1.827756 3.081683 2.055773
H  5.065961 1.910232 3.339358
H  9.983227 7.956468 -3.018674
H  4.849697 1.770713 6.789411
H  9.701233 11.168501 1.772059
H  1.896929 10.99678 -3.032559
exchangeener: -1183.116140771568 hartree
correlationener: -37.192137591001 hartree
xcener: -1220.308278362568 hartree
s2: 2.002177
chargesum: -0.0000000
charge: 0.853535 0.764349 0.823921 0.798314 0.832196 0.823738 0.825784 0.818801 0.815856 0.773265 0.831972 0.799433 0.886406 0.854171 0.928668 0.886017 0.855338 0.928452 0.826093 0.764492 0.853813 0.773305 0.799289 0.816132 0.818562 0.798344 -0.305643 -0.423845 -0.423998 -0.567224 -0.325756 -0.324748 -0.325794 -0.425722 -0.470289 -0.425838 -0.317771 -0.317327 -0.452908 -0.318091 -0.408185 -0.362503 -0.452017 -0.417551 -0.317438 -0.354439 -0.370277 -0.477020 -0.312336 -0.311718 -0.459929 -0.358363 -0.298355 -0.450631 -0.502839 -0.507186 -0.423176 -0.401574 -0.401576 -0.474661 -0.408425 -0.567168 -0.458027 -0.502420 -0.518806 -0.472177 -0.507079 -0.439974 -0.474382 -0.423258 -0.450785 -0.440267 -0.518505 -0.479844 -0.472119 -0.452884 -0.305602 -0.324867 -0.325906 -0.370285 -0.312266 -0.358215 -0.362600 -0.318064 -0.477262 -0.354465 -0.311667 -0.451936 -0.440204 -0.298165 -0.325981 -0.417644 -0.408176 -0.480925 -0.317813 -0.440343 0.763632 0.764263 0.385746 0.385780 0.212912 0.122347 0.146420 0.157321 0.176831 0.181342 0.199036 0.157765 0.181386 0.164890 0.112397 0.187303 0.186642 0.135814 0.171602 0.212916 0.146530 0.157359 0.112351 0.187283 0.135826 0.157777 0.198994 0.164958 0.186590 0.171646 0.122443 0.176887
charge: 0.431805 0.428471 0.453113 0.450619 0.462803 0.453157 0.455820 0.448342 0.448954 0.432819 0.462663 0.448262 0.469508 0.449347 0.477343 0.469580 0.449910 0.477309 0.455879 0.428435 0.431865 0.432859 0.448242 0.448830 0.448361 0.450644 -0.156847 -0.238336 -0.238418 -0.227710 -0.193837 -0.182658 -0.185563 -0.239738 -0.257543 -0.239764 -0.177293 -0.173720 -0.257389 -0.160504 -0.229732 -0.191561 -0.258702 -0.229592 -0.173834 -0.177499 -0.209469 -0.251298 -0.165436 -0.168084 -0.252928 -0.192618 -0.163553 -0.241988 -0.256566 -0.268539 -0.236769 -0.226463 -0.226413 -0.250096 -0.232552 -0.227500 -0.245816 -0.256701 -0.240494 -0.251747 -0.268327 -0.241441 -0.250146 -0.236804 -0.242091 -0.241595 -0.240166 -0.251318 -0.251628 -0.257461 -0.156807 -0.182699 -0.185691 -0.209436 -0.165381 -0.192487 -0.191591 -0.160455 -0.251262 -0.177484 -0.168038 -0.258669 -0.250217 -0.163462 -0.194038 -0.229508 -0.229735 -0.251350 -0.177324 -0.250279 0.163648 0.162746 0.398525 0.397551 0.127338 0.058055 0.077306 0.080342 0.101415 0.104795 0.110172 0.074529 0.104842 0.081988 0.044189 0.101746 0.105562 0.061309 0.093469 0.127321 0.077417 0.080415 0.044144 0.101748 0.061303 0.074549 0.110133 0.082069 0.105490 0.093496 0.058141 0.101464
qa: 0.8535 0.7643 0.8239 0.7983 0.8322 0.8237 0.8258 0.8188 0.8159 0.7733 0.8320 0.7994 0.8864 0.8542 0.9287 0.8860 0.8553 0.9285 0.8261 0.7645 0.8538 0.7733 0.7993 0.8161 0.8186 0.7983 -0.3056 -0.4238 -0.4240 -0.5672 -0.3258 -0.3247 -0.3258 -0.4257 -0.4703 -0.4258 -0.3178 -0.3173 -0.4529 -0.3181 -0.4082 -0.3625 -0.4520 -0.4176 -0.3174 -0.3544 -0.3703 -0.4770 -0.3123 -0.3117 -0.4599 -0.3584 -0.2984 -0.4506 -0.5028 -0.5072 -0.4232 -0.4016 -0.4016 -0.4747 -0.4084 -0.5672 -0.4580 -0.5024 -0.5188 -0.4722 -0.5071 -0.4400 -0.4744 -0.4233 -0.4508 -0.4403 -0.5185 -0.4798 -0.4721 -0.4529 -0.3056 -0.3249 -0.3259 -0.3703 -0.3123 -0.3582 -0.3626 -0.3181 -0.4773 -0.3545 -0.3117 -0.4519 -0.4402 -0.2982 -0.3260 -0.4176 -0.4082 -0.4809 -0.3178 -0.4403 0.7636 0.7643 0.3857 0.3858 0.2129 0.1223 0.1464 0.1573 0.1768 0.1813 0.1990 0.1578 0.1814 0.1649 0.1124 0.1873 0.1866 0.1358 0.1716 0.2129 0.1465 0.1574 0.1124 0.1873 0.1358 0.1578 0.1990 0.1650 0.1866 0.1716 0.1224 0.1769
va: 4.7041 4.8283 4.7784 4.7975 4.7653 4.7785 4.7590 4.7614 4.7847 4.8138 4.7655 4.7822 4.7133 4.7433 4.6504 4.7137 4.7417 4.6508 4.7585 4.8281 4.7037 4.8138 4.7824 4.7844 4.7616 4.7975 2.2575 2.2776 2.2773 2.1945 2.1664 2.1953 2.2038 2.2726 2.2474 2.2725 2.2193 2.2277 2.2392 2.2511 2.2964 2.1643 2.2414 2.2923 2.2275 2.1864 2.1115 2.2283 2.2307 2.2252 2.2576 2.1524 2.2478 2.2700 2.2254 2.2590 2.3008 2.3053 2.3052 2.2527 2.3117 2.1946 2.2821 2.2257 2.2419 2.2518 2.2593 2.2799 2.2529 2.3007 2.2699 2.2797 2.2423 2.2887 2.2519 2.2392 2.2576 2.1953 2.2036 2.1114 2.2307 2.1526 2.1642 2.2511 2.2283 2.1864 2.2253 2.2415 2.2579 2.2481 2.1662 2.2923 2.2964 2.2877 2.2193 2.2578 3.7234 3.7222 1.8664 1.8667 0.9873 1.0330 1.0235 1.0187 1.0074 1.0055 0.9963 1.0199 1.0055 1.0170 1.0421 1.0024 1.0018 1.0326 1.0115 0.9873 1.0235 1.0187 1.0421 1.0024 1.0326 1.0199 0.9963 1.0169 1.0019 1.0115 1.0329 1.0074
dispcorr: -0.258250508 hartree
dipole: 228.07949 -233.67143 -5.59194 132.01298 -135.24294 -3.22997 22.40581 -17.66811 4.73770
magnitude: 8.00927 au
magnitude: 20.35794 debye
