program: Orca
programVersion: 5.0.2
elementType: Si Si Si Si Si Si Si Si Si Si Si Si Si Si Si Si Si Si Si Si Si Si Si Si Si Si O O O O O O O O O O O O O O O O O O O O O O O O O O O O O O O O O O O O O O O O O O O O O O O O O O O O O O O O O O O O O O O O O O O O O O Al Al Ag Ag O O H H H H H H H H H H H H H H H H H H H H H H H H H H H H
elementType: Ag
charge: 0
multiplicity: 1
keywords: QMMM pbe d3bj def2-svp
formula: H28Al2O72Si26Ag2
InChI: InChI=1S/2Ag.2Al.H28O70Si26.O2/c;;;;1-71(2,3)37-81(23)53-87(29)43-75(11,12)39-73(7,8)41-83(25)45-77(15,16)47-85(27)59-86(28)48-78(17,18)46-84(26,58-94(36,61-86)63-93(35,57-83)60-85)42-74(9,10)40-76(13,14)44-88(30)54-82(24,38-72(4,5)6)56-90(32)50-80(21,22)52-92(34)62-91(33)51-79(19,20)49-89(31,55-81)66-95(64-87,68-91)70-96(65-88,67-90)69-92;1-2/h;;;;1-2,4-5,7,9,11-28,31-34H;/q;;2*+3;-6;
130 atoms
Si -1.650222 12.997522 3.515508
Si 3.120868 15.779475 6.528626
Si 5.256481 9.124927 -1.559392
Si 5.286739 14.485265 1.582806
Si 1.573191 10.558645 11.563652
Si 3.718924 11.786917 -1.557839
Si -1.511299 10.508391 8.445583
Si 3.10698 15.829228 3.422893
Si -1.545743 13.084657 6.630783
Si 5.28943 14.487905 -1.539364
Si 3.1196 7.881138 11.562931
Si -1.554816 10.511677 11.57978
Si 3.082629 7.876309 8.447042
Si 5.328048 9.171548 1.540534
Si 5.29046 6.583077 6.605732
Si 1.5505 10.530236 8.447267
Si 3.794654 11.821434 1.543009
Si 1.533788 13.090202 6.609311
Si 1.533405 5.234807 8.445512
Si 8.413308 6.611124 6.528838
Si 3.618057 3.87103 3.515934
Si 8.380571 9.134532 -1.539852
Si 1.514174 5.195685 11.579217
Si 3.74685 3.917208 6.628969
Si 8.451781 6.573676 3.423687
Si 8.378489 9.133632 1.58187
O  -2.436208 11.564333 12.40328
O  2.458229 6.458473 11.963594
O  0.01043 10.697359 11.964936
O  4.966523 7.022121 5.075464
O  6.817461 14.788498 2.09855
O  -2.494731 9.321042 7.91125
O  2.700912 17.329646 2.921551
O  4.368411 13.2300 -1.950233
O  4.802484 10.637801 -1.926981
O  6.831011 8.966302 -1.951645
O  4.415935 8.040116 -2.415201
O  4.485984 8.06939 12.40949
O  3.576388 15.915863 4.977237
O  -2.559131 11.913826 2.746775
O  4.384772 15.45354 2.48062
O  1.928505 16.833707 6.902975
O  5.195928 14.927649 0.016942
O  -1.884581 11.802735 7.557696
O  2.41944 11.648267 12.40969
O  -1.941187 14.557868 3.130926
O  6.822739 14.012242 -1.934579
O  -1.906911 12.706401 5.099217
O  4.47291 15.989595 7.376349
O  4.812772 15.770912 -2.385627
O  2.046684 9.046782 11.9043
O  -1.892186 8.946409 11.928536
O  -2.528138 14.265983 7.142587
O  5.027094 8.771569 -0.001833
O  1.891522 6.802512 8.214689
O  6.969614 5.990001 3.265879
O  4.400928 7.512789 7.585915
O  2.493338 14.344343 6.945649
O  6.856287 6.784949 6.944443
O  4.935964 5.013248 6.797957
O  4.358872 10.378839 2.002067
O  1.745031 12.59046 5.078343
O  2.51437 9.317554 7.976331
O  0.025229 10.035842 8.211905
O  4.076999 5.393731 3.192704
O  6.864833 9.678471 1.70449
O  1.863903 14.833869 3.263056
O  3.539036 7.90366 9.992109
O  -0.00316 13.567552 6.804793
O  1.895546 11.855315 7.589564
O  3.298805 11.762495 -0.000105
O  1.800691 10.910769 9.992824
O  -0.102899 12.633602 3.188271
O  4.97795 7.909289 2.461141
O  4.998933 12.902712 1.707128
O  8.760718 6.938361 4.977765
O  1.985393 3.907094 12.404206
O  0.013367 4.977002 7.911522
O  9.549861 5.473426 2.922492
O  8.735334 10.700264 -1.934888
O  9.270474 7.676743 7.377731
O  -0.009905 5.686665 11.927921
O  8.729927 5.051171 6.902217
O  2.226994 3.628427 2.743404
O  3.236969 3.786574 5.09889
O  4.824299 2.838689 3.130497
O  9.25289 8.079694 -2.385861
O  8.715964 8.83338 0.016171
O  1.636823 4.809376 9.997789
O  4.28185 2.477904 7.143856
O  9.407535 10.306716 2.098074
O  2.468986 4.265401 7.558137
O  8.762605 7.868032 2.48045
O  2.526109 12.143668 2.464707
O  2.359548 11.601699 -2.414374
O  -1.827023 10.810252 9.997808
Al 5.384436 6.531317 3.427151
Al 1.540041 13.190412 3.427085
Ag 0.996946 10.685324 4.081314
Ag 2.956892 7.357136 4.07113
O  1.282896 8.610371 3.611808
O  2.06606 9.073509 4.619418
H  -3.171232 11.697797 13.036402
H  7.71068 14.612382 1.772108
H  -2.845216 8.47943 8.244814
H  2.035884 17.958268 3.24278
H  3.657598 7.940918 -3.02867
H  4.931783 8.671848 13.039028
H  -3.22321 11.848714 2.046211
H  1.711984 17.746996 6.695793
H  3.164142 11.733289 13.039112
H  -2.61115 15.233411 3.331314
H  7.710199 14.285711 -1.702773
H  4.926255 16.560497 8.018631
H  5.072679 16.466463 -3.016165
H  -2.59043 8.324144 11.71299
H  -2.859342 15.113121 6.797113
H  1.733327 3.203362 13.036793
H  -0.890863 5.094439 8.244929
H  9.759879 4.582667 3.243178
H  9.415456 11.332425 -1.702904
H  9.992503 7.784137 8.019215
H  -0.897991 5.392951 11.71273
H  9.41317 4.40725 6.695472
H  1.838201 3.083963 2.044785
H  5.07484 1.920456 3.331133
H  9.985068 7.957653 -3.016263
H  4.848178 1.766334 6.797649
H  9.699697 11.169147 1.771907
H  1.894251 10.995052 -3.02832
exchangeener: -1196.946091702850 hartree
correlationener: -37.672633241776 hartree
xcener: -1234.618724944626 hartree
chargesum: 0.0000000
charge: 0.901115 0.774650 0.826016 0.799430 0.828490 0.825798 0.813433 0.825673 0.818223 0.776042 0.828467 0.795136 0.880962 0.890231 0.956254 0.881110 0.890002 0.955256 0.813383 0.774875 0.898179 0.775791 0.795049 0.817217 0.825511 0.799366 -0.305790 -0.425705 -0.425757 -0.567032 -0.323118 -0.318086 -0.320709 -0.425678 -0.469062 -0.425674 -0.315752 -0.317029 -0.453803 -0.312812 -0.406199 -0.363644 -0.451217 -0.411455 -0.317054 -0.367659 -0.369469 -0.462631 -0.316390 -0.310033 -0.464036 -0.359872 -0.304188 -0.451893 -0.484348 -0.491768 -0.417080 -0.410193 -0.410481 -0.470133 -0.429478 -0.566062 -0.432589 -0.484445 -0.538117 -0.471245 -0.492074 -0.448457 -0.470163 -0.416931 -0.452392 -0.448157 -0.538547 -0.510867 -0.471647 -0.453871 -0.305779 -0.317983 -0.320511 -0.369479 -0.316564 -0.359899 -0.363711 -0.312296 -0.461533 -0.368909 -0.309784 -0.451048 -0.445891 -0.304598 -0.323142 -0.411184 -0.406066 -0.509533 -0.315929 -0.445654 0.832290 0.828500 0.391232 0.389679 -0.161569 -0.204375 0.207655 0.124304 0.144403 0.160004 0.179536 0.175930 0.197807 0.159246 0.175928 0.176415 0.113922 0.192259 0.189009 0.134443 0.169656 0.207608 0.144419 0.159957 0.113892 0.192334 0.134469 0.159318 0.197467 0.176401 0.188836 0.169672 0.124403 0.179575
charge: 0.452893 0.435060 0.454549 0.453319 0.459637 0.454664 0.453749 0.453291 0.456740 0.434091 0.459671 0.444919 0.475428 0.470804 0.498399 0.475211 0.470915 0.498189 0.453935 0.435188 0.452560 0.434014 0.444863 0.456821 0.453420 0.453260 -0.157928 -0.239328 -0.239331 -0.194607 -0.191098 -0.179717 -0.183164 -0.239624 -0.257323 -0.239547 -0.174862 -0.175185 -0.256423 -0.152698 -0.227006 -0.191856 -0.257663 -0.227578 -0.175189 -0.190043 -0.208039 -0.249762 -0.168557 -0.166122 -0.253986 -0.193975 -0.167621 -0.241966 -0.255107 -0.255154 -0.233591 -0.229635 -0.229796 -0.249996 -0.229891 -0.194647 -0.236174 -0.254944 -0.206707 -0.252993 -0.255162 -0.244583 -0.250129 -0.233439 -0.242317 -0.244445 -0.205284 -0.231792 -0.253202 -0.256484 -0.157953 -0.179745 -0.183084 -0.207998 -0.168737 -0.193990 -0.191897 -0.152856 -0.249929 -0.191041 -0.165902 -0.257541 -0.253025 -0.167959 -0.191132 -0.227577 -0.226869 -0.232885 -0.175022 -0.252898 0.207874 0.208821 0.107493 0.107271 0.017533 0.074361 0.122354 0.059517 0.075189 0.081164 0.103330 0.100200 0.109224 0.076217 0.100187 0.092508 0.045394 0.107489 0.107590 0.060419 0.091885 0.122334 0.075250 0.081068 0.045366 0.107606 0.060440 0.076322 0.108924 0.092574 0.107356 0.091907 0.059559 0.103396
qa: 0.9011 0.7746 0.8260 0.7994 0.8285 0.8258 0.8134 0.8257 0.8182 0.7760 0.8285 0.7951 0.8810 0.8902 0.9563 0.8811 0.8900 0.9553 0.8134 0.7749 0.8982 0.7758 0.7950 0.8172 0.8255 0.7994 -0.3058 -0.4257 -0.4258 -0.5670 -0.3231 -0.3181 -0.3207 -0.4257 -0.4691 -0.4257 -0.3158 -0.3170 -0.4538 -0.3128 -0.4062 -0.3636 -0.4512 -0.4115 -0.3171 -0.3677 -0.3695 -0.4626 -0.3164 -0.3100 -0.4640 -0.3599 -0.3042 -0.4519 -0.4843 -0.4918 -0.4171 -0.4102 -0.4105 -0.4701 -0.4295 -0.5661 -0.4326 -0.4844 -0.5381 -0.4712 -0.4921 -0.4485 -0.4702 -0.4169 -0.4524 -0.4482 -0.5385 -0.5109 -0.4716 -0.4539 -0.3058 -0.3180 -0.3205 -0.3695 -0.3166 -0.3599 -0.3637 -0.3123 -0.4615 -0.3689 -0.3098 -0.4510 -0.4459 -0.3046 -0.3231 -0.4112 -0.4061 -0.5095 -0.3159 -0.4457 0.8323 0.8285 0.3912 0.3897 -0.1616 -0.2044 0.2077 0.1243 0.1444 0.1600 0.1795 0.1759 0.1978 0.1592 0.1759 0.1764 0.1139 0.1923 0.1890 0.1344 0.1697 0.2076 0.1444 0.1600 0.1139 0.1923 0.1345 0.1593 0.1975 0.1764 0.1888 0.1697 0.1244 0.1796
va: 4.6404 4.8170 4.7762 4.7962 4.7720 4.7764 4.7793 4.7552 4.7773 4.8107 4.7720 4.7887 4.7221 4.7028 4.6078 4.7221 4.7027 4.6093 4.7794 4.8169 4.6447 4.8111 4.7888 4.7785 4.7555 4.7963 2.2528 2.2748 2.2746 2.2037 2.1716 2.1995 2.2142 2.2734 2.2490 2.2734 2.2251 2.2217 2.2403 2.2571 2.2992 2.1639 2.2425 2.2961 2.2217 2.1789 2.1144 2.2396 2.2282 2.2295 2.2533 2.1484 2.2379 2.2704 2.2416 2.2813 2.3038 2.2999 2.2997 2.2571 2.3014 2.2048 2.2990 2.2416 2.2250 2.2549 2.2810 2.2742 2.2570 2.3040 2.2698 2.2744 2.2245 2.2509 2.2545 2.2403 2.2527 2.1996 2.2144 2.1143 2.2280 2.1484 2.1639 2.2570 2.2405 2.1771 2.2298 2.2427 2.2520 2.2374 2.1717 2.2963 2.2993 2.2522 2.2248 2.2524 3.6019 3.6088 2.3331 2.3365 1.9459 2.0015 0.9905 1.0324 1.0243 1.0182 1.0062 1.0081 0.9968 1.0193 1.0081 1.0108 1.0415 0.9993 1.0006 1.0331 1.0125 0.9905 1.0243 1.0183 1.0416 0.9993 1.0331 1.0192 0.9970 1.0108 1.0007 1.0125 1.0323 1.0062
dispcorr: -0.262648976 hartree
dipole: 171.54976 -175.68041 -4.13065 97.28911 -99.62697 -2.33786 115.20825 -112.76554 2.44271
magnitude: 5.33804 au
magnitude: 13.56823 debye
