program: Orca
programVersion: 5.0.2
elementType: N H C C H H O C C O N H H H C C O H O H N H H H C H H C C C C H C H C H H O H
charge: 1
multiplicity: 1
keywords: wB97X-D3BJ Opt Freq def2-TZVPP def2/J RIJCOSX VeryTightSCF
keywords: PAL8 defgrid3 VeryTightOpt
frequency: 0.00 0.00 0.00 0.00 0.00 0.00 16.80 22.87 30.11 34.06 46.85 61.14 66.10 87.36 111.83 132.99 167.62 186.60 202.49 231.32 264.40 299.89 314.58 337.95 361.99 381.24 382.78 393.70 428.13 428.95 436.46 481.52 510.28 523.22 528.68 540.13 564.40 609.07 625.03 659.22 669.02 673.32 681.22 721.40 750.34 784.38 810.87 847.40 853.25 857.93 875.32 885.21 899.04 908.91 966.32 982.94 1009.93 1019.55 1041.68 1049.67 1058.78 1106.65 1141.26 1149.14 1167.30 1169.92 1199.18 1206.72 1207.90 1247.91 1268.99 1278.62 1287.38 1310.36 1320.80 1333.00 1335.17 1348.39 1367.82 1372.26 1393.37 1395.83 1414.93 1458.64 1465.65 1495.56 1497.48 1503.63 1507.58 1525.49 1570.57 1580.84 1622.59 1673.06 1679.48 1701.21 1738.40 1805.12 1887.58 3071.96 3084.82 3116.18 3125.04 3128.82 3144.94 3168.29 3178.16 3186.53 3188.49 3205.20 3231.55 3443.26 3529.32 3631.37 3670.54 3799.74 3877.04
frequency: 16.80 22.87 30.11 34.06 46.85 61.14 66.10 87.36 111.83 132.99 167.62 186.60 202.49 231.32 264.40 299.89 314.58 337.95 361.99 381.24 382.78 393.70 428.13 428.95 436.46 481.52 510.28 523.22 528.68 540.13 564.40 609.07 625.03 659.22 669.02 673.32 681.22 721.40 750.34 784.38 810.87 847.40 853.25 857.93 875.32 885.21 899.04 908.91 966.32 982.94 1009.93 1019.55 1041.68 1049.67 1058.78 1106.65 1141.26 1149.14 1167.30 1169.92 1199.18 1206.72 1207.90 1247.91 1268.99 1278.62 1287.38 1310.36 1320.80 1333.00 1335.17 1348.39 1367.82 1372.26 1393.37 1395.83 1414.93 1458.64 1465.65 1495.56 1497.48 1503.63 1507.58 1525.49 1570.57 1580.84 1622.59 1673.06 1679.48 1701.21 1738.40 1805.12 1887.58 3071.96 3084.82 3116.18 3125.04 3128.82 3144.94 3168.29 3178.16 3186.53 3188.49 3205.20 3231.55 3443.26 3529.32 3631.37 3670.54 3799.74 3877.04
formula: C13H18N3O5
InChI: InChI=1S/C13H18N3O5/c14-10(5-8-1-3-9(17)4-2-8)13(21)16-6-11(18)15-7-12(19)20/h1-4,10,15-17,19H,5-7H2,14H3
39 atoms
N  -0.870127 2.021504 2.950664
H  -0.661478 1.993694 3.93804
C  -1.689549 3.119691 2.466778
C  -2.176668 4.036047 3.575954
H  -1.139121 3.753721 1.767121
H  -2.584741 2.759802 1.95524
O  -2.897075 4.96572 3.367416
C  -0.337493 1.056687 2.197852
C  -0.648917 1.099404 0.691073
O  0.36561 0.163699 2.677996
N  0.007285 -0.011681 0.038456
H  -0.294222 2.039563 0.269616
H  -1.724715 1.040403 0.524236
H  -0.449997 -0.901105 0.146147
C  1.363091 -0.018075 0.123832
C  2.067867 -1.361898 0.355962
O  2.041728 0.986761 0.171048
H  2.909565 -1.438189 -0.331881
O  -1.708092 3.690691 4.788945
H  -2.057608 4.321592 5.433227
N  2.645655 -1.147576 1.733885
H  3.046578 -2.01885 2.089757
H  3.348871 -0.409559 1.697545
H  1.876708 -0.808197 2.345489
C  1.252677 -2.652196 0.358068
H  0.847874 -2.796975 -0.646259
H  0.411377 -2.55809 1.050706
C  2.110152 -3.826224 0.771041
C  3.029171 -4.387742 -0.113186
C  2.042999 -4.334986 2.069147
C  3.860243 -5.423393 0.282476
H  3.092292 -4.024268 -1.134178
C  2.870974 -5.367364 2.481043
H  1.313041 -3.936488 2.768465
C  3.786165 -5.915984 1.585517
H  4.561984 -5.855939 -0.422727
H  2.810865 -5.770389 3.484041
O  4.568074 -6.922532 2.036885
H  5.139363 -7.249743 1.337246
totalener: -1047.13422495 hartree
nucrepener: 1640.34169254 hartree
electener: -2687.47591749 hartree
oneelecener: -4664.69467901 hartree
twoeener: 1977.21876152 hartree
kineticenergy: 1041.97966638 hartree
exchangeener: -91.588700053396 hartree
correlationener: -6.612916107136 hartree
xcener: -98.201616160532 hartree
temp: 298.15 k
press: 1.00 atm
thermalcorrenthalpy: 0.00094421 hartree
totalenthalpy: -1046.87375153 hartree
totalentropycorr: -0.06438873 hartree
gibbsenthalpy: -1046.93814027 hartree
gibbsminuselec: 0.27731287 hartree
totalenthalpy: -1046.87532168 hartree
chargesum: 1.0000000
charge: -0.143764 0.197584 -0.093492 0.271983 0.144008 0.136826 -0.267811 0.303133 -0.104454 -0.463368 -0.156650 0.148933 0.148159 0.176548 0.136941 0.049515 -0.325020 0.170408 -0.282574 0.244338 -0.076283 0.232213 0.240239 0.248355 -0.208071 0.147062 0.114352 -0.000841 -0.177054 -0.236707 -0.140169 0.136524 -0.127691 0.148498 0.197281 0.116612 0.145555 -0.269277 0.218160
charge: 0.346202 -0.009323 -0.029367 -0.433067 0.039167 0.037394 0.149940 -0.358502 -0.033307 0.057654 0.328681 0.040833 0.034758 -0.023580 -0.387189 -0.039082 0.116900 0.045273 0.357336 -0.074566 0.617521 0.039874 0.051503 0.008115 -0.011613 0.044113 0.032592 -0.116029 -0.000648 -0.020672 -0.006305 0.028197 0.006704 0.024509 -0.189911 0.023838 0.031694 0.371828 -0.101466
qa: -0.1438 0.1976 -0.0935 0.2720 0.1440 0.1368 -0.2678 0.3031 -0.1045 -0.4634 -0.1567 0.1489 0.1482 0.1765 0.1369 0.0495 -0.3250 0.1704 -0.2826 0.2443 -0.0763 0.2322 0.2402 0.2484 -0.2081 0.1471 0.1144 -0.0008 -0.1771 -0.2367 -0.1402 0.1365 -0.1277 0.1485 0.1973 0.1166 0.1456 -0.2693 0.2182
va: 3.1700 1.0267 3.8355 4.3685 0.9944 0.9975 2.2412 4.1564 3.8483 2.0253 3.2137 1.0092 0.9977 1.0181 4.3846 3.7795 2.1817 1.0077 2.1718 1.0146 3.6253 0.9907 0.9842 1.0316 3.8482 1.0022 1.0191 3.5813 4.0506 3.9710 3.9520 1.0043 3.9990 0.9999 4.0905 1.0069 1.0077 2.2320 1.0251
dispcorr: -0.082004866 hartree
energy: -1047.221006479381
dipole: 2.37801 -1.60616 0.77185 -6.03332 5.20019 -0.83312 -3.99076 3.73197 -0.25879
magnitude: 1.16483 au
magnitude: 2.96075 debye
zeropoint: 0.32425904 hartree
thermalvibcorrection: 0.01764271 hartree
thermalrotcorrection: 0.00141627 hartree
thermaltrasncorrection: 0.00141627 hartree
thermaltotal: -1046.87627218 hartree
thermalcorr: 0.02047525 hartree
nonthermalcorr: 0.32425904 hartree
totalcorr: 0.34473430 hartree
totalenthalpy: -1046.87532797 hartree
