program: Orca
programVersion: 5.0.2
elementType: N H C C H H O C C O N H H H C C O H O H N H H H C H H C C C C H C H C H H O H
charge: 1
multiplicity: 1
keywords: wB97X-D3BJ Opt Freq def2-TZVPP def2/J RIJCOSX VeryTightSCF
keywords: PAL8 defgrid3 VeryTightOpt
frequency: 0.00 0.00 0.00 0.00 0.00 0.00 11.29 25.00 40.76 47.61 53.73 57.74 68.38 84.93 101.87 112.04 152.56 164.61 187.28 195.29 278.85 284.18 299.75 317.55 324.69 370.50 378.09 399.64 404.88 425.56 437.21 441.04 458.47 526.58 541.07 563.21 587.27 593.81 632.23 659.22 678.14 684.92 703.01 721.95 742.38 773.07 803.82 847.56 852.80 868.93 884.41 908.35 934.50 960.18 976.40 996.81 1004.95 1014.34 1028.32 1033.26 1042.61 1098.39 1136.74 1154.94 1157.65 1183.30 1200.41 1206.42 1209.79 1228.22 1251.20 1258.68 1266.97 1277.33 1299.32 1324.00 1335.15 1337.56 1352.52 1365.38 1375.76 1386.32 1397.37 1434.34 1459.20 1490.30 1496.87 1503.06 1510.81 1528.97 1583.36 1593.11 1636.57 1671.36 1677.61 1701.93 1771.73 1791.56 1895.44 2947.50 3046.66 3057.35 3081.04 3085.18 3107.70 3122.61 3152.15 3178.67 3188.93 3207.07 3229.76 3507.07 3509.93 3573.37 3583.60 3857.79 3879.39
frequency: 11.29 25.00 40.76 47.61 53.73 57.74 68.38 84.93 101.87 112.04 152.56 164.61 187.28 195.29 278.85 284.18 299.75 317.55 324.69 370.50 378.09 399.64 404.88 425.56 437.21 441.04 458.47 526.58 541.07 563.21 587.27 593.81 632.23 659.22 678.14 684.92 703.01 721.95 742.38 773.07 803.82 847.56 852.80 868.93 884.41 908.35 934.50 960.18 976.40 996.81 1004.95 1014.34 1028.32 1033.26 1042.61 1098.39 1136.74 1154.94 1157.65 1183.30 1200.41 1206.42 1209.79 1228.22 1251.20 1258.68 1266.97 1277.33 1299.32 1324.00 1335.15 1337.56 1352.52 1365.38 1375.76 1386.32 1397.37 1434.34 1459.20 1490.30 1496.87 1503.06 1510.81 1528.97 1583.36 1593.11 1636.57 1671.36 1677.61 1701.93 1771.73 1791.56 1895.44 2947.50 3046.66 3057.35 3081.04 3085.18 3107.70 3122.61 3152.15 3178.67 3188.93 3207.07 3229.76 3507.07 3509.93 3573.37 3583.60 3857.79 3879.39
formula: C13H18N3O5
InChI: InChI=1S/C13H18N3O5/c14-10(5-8-1-3-9(17)4-2-8)13(21)16-6-11(18)15-7-12(19)20/h1-4,10,15-17,19H,5-7H2,14H3
39 atoms
N  -3.30296 1.553637 0.170688
H  -4.264601 1.235627 0.168928
C  -3.123725 2.977823 0.305003
C  -4.506754 3.617844 0.414183
H  -2.55331 3.238724 1.203466
H  -2.611449 3.412289 -0.56075
O  -5.5153 2.978038 0.387337
C  -2.338039 0.627054 0.047233
C  -0.894821 1.13635 0.056456
O  -2.559292 -0.566829 -0.066259
N  -0.052878 -0.031909 -0.068474
H  -0.680023 1.668608 0.986811
H  -0.724101 1.830631 -0.76986
H  -0.572494 -0.906341 -0.073268
C  1.26166 0.007124 0.028109
C  2.009157 -1.341849 0.019455
O  1.945035 1.029744 0.128716
H  1.650411 -1.989231 -0.779158
O  -4.520818 4.950987 0.543817
H  -3.634145 5.325157 0.547017
N  3.424613 -0.927688 -0.278549
H  4.102542 -1.393414 0.320829
H  3.689041 -1.069179 -1.25097
H  3.381809 0.110119 -0.079834
C  1.956411 -2.062097 1.376615
H  2.429326 -1.422606 2.128112
H  2.548025 -2.979708 1.296976
C  0.539576 -2.369559 1.789328
C  -0.203124 -3.339479 1.121861
C  -0.079502 -1.632027 2.796903
C  -1.53787 -3.553589 1.430028
H  0.258903 -3.94573 0.347968
C  -1.407878 -1.839446 3.120405
H  0.485234 -0.879206 3.337802
C  -2.148714 -2.793452 2.424837
H  -2.105662 -4.307255 0.89565
H  -1.891591 -1.271258 3.904862
O  -3.448753 -2.935145 2.765518
H  -3.87717 -3.583419 2.200866
totalener: -1047.12273737 hartree
nucrepener: 1713.36711283 hartree
electener: -2760.48985020 hartree
oneelecener: -4811.62268576 hartree
twoeener: 2051.13283556 hartree
kineticenergy: 1041.96112833 hartree
exchangeener: -91.584974616411 hartree
correlationener: -6.613842835425 hartree
xcener: -98.198817451837 hartree
temp: 298.15 k
press: 1.00 atm
thermalcorrenthalpy: 0.00094421 hartree
totalenthalpy: -1046.86501728 hartree
totalentropycorr: -0.06464158 hartree
gibbsenthalpy: -1046.92965886 hartree
gibbsminuselec: 0.27482690 hartree
totalenthalpy: -1046.86648294 hartree
chargesum: 1.0000000
charge: -0.161047 0.205422 -0.153061 0.306364 0.123958 0.123707 -0.275868 0.236659 -0.079472 -0.373435 -0.139933 0.122504 0.137753 0.204680 0.207846 0.000110 -0.384078 0.162654 -0.210463 0.214680 -0.066138 0.229798 0.232296 0.234077 -0.164061 0.127498 0.133980 -0.032994 -0.212008 -0.145744 -0.112626 0.120783 -0.159167 0.124123 0.233829 0.108015 0.136341 -0.274679 0.217696
charge: 0.337549 -0.006077 -0.059893 -0.431250 0.025777 0.026087 0.156545 -0.383189 -0.023258 0.092968 0.368894 0.031561 0.032820 -0.014208 -0.375992 -0.032377 0.101433 0.036295 0.394492 -0.097720 0.607271 0.043374 0.046264 0.002841 -0.007425 0.039217 0.035135 -0.115264 -0.012575 -0.004831 -0.006834 0.023602 0.006259 0.024854 -0.187210 0.022881 0.029760 0.373554 -0.101331
qa: -0.1610 0.2054 -0.1531 0.3064 0.1240 0.1237 -0.2759 0.2367 -0.0795 -0.3734 -0.1399 0.1225 0.1378 0.2047 0.2078 0.0001 -0.3841 0.1627 -0.2105 0.2147 -0.0661 0.2298 0.2323 0.2341 -0.1641 0.1275 0.1340 -0.0330 -0.2120 -0.1457 -0.1126 0.1208 -0.1592 0.1241 0.2338 0.1080 0.1363 -0.2747 0.2177
va: 3.1741 1.0311 3.8925 4.3552 0.9830 0.9838 2.2218 4.2883 3.8239 2.1360 3.2873 1.0053 1.0002 1.0347 4.2686 3.8285 2.1482 0.9969 2.2660 1.0264 3.6047 0.9779 0.9772 1.0468 3.8256 1.0083 0.9992 3.6449 4.0302 3.9913 3.9598 1.0084 3.9987 1.0031 4.0495 1.0083 1.0101 2.2300 1.0257
dispcorr: -0.082445661 hartree
energy: -1047.210658301307
dipole: 16.02281 -10.09217 5.93063 -4.22193 3.52545 -0.69648 -1.35296 -0.23230 -1.58526
magnitude: 6.17823 au
magnitude: 15.70382 debye
zeropoint: 0.32248157 hartree
thermalvibcorrection: 0.01792581 hartree
thermalrotcorrection: 0.00141627 hartree
thermaltrasncorrection: 0.00141627 hartree
thermaltotal: -1046.86741837 hartree
thermalcorr: 0.02075835 hartree
nonthermalcorr: 0.32248157 hartree
totalcorr: 0.34323993 hartree
totalenthalpy: -1046.86647417 hartree
