program: Gaussian 09
title: 000047297
version: EM64L-G09RevD.01
frameworkgroup: C1[X(C10H18N6O2S)]
method: RPBEPBE
basis: SDD
operation: Freq
keyword: #p
keyword: freq=noraman
keyword: PBEPBE/SDD
title: #p freq=noraman PBEPBE/SDD
converged: YES YES NO NO
title: Mulliken charges:
elementType: S O O N N N N N N C C C C C C C C C C H H H H H H H H H H H H H H H H H H
charge: 0.212344 -0.435316 -0.205477 -0.129686 -0.129721 -0.183709 -0.086086 -0.087358 -0.620230 -0.108290 -0.692460 0.181411 0.154360 -0.277106 0.223708 -0.621918 -0.625273 -0.626848 -0.628048 0.243464 0.255253 0.328173 0.300082 0.278605 0.286627 0.217331 0.221836 0.222063 0.219076 0.281064 0.220571 0.280594 0.220136 0.217466 0.297705 0.217761 0.377895
chargesum: 0.00000
title: Mulliken charges with hydrogens summed into heavy atoms:
elementType: S O O N N N N N N C C C C C C C C C C
charge: 0.212344 -0.057421 -0.205477 -0.129686 -0.129721 -0.183709 -0.086086 -0.087358 -0.041543 0.135174 -0.109034 0.181411 0.154360 -0.277106 0.223708 0.103876 0.096930 0.094453 0.104885
polarizability: 2.47967500e+02 -1.16034351e+01 2.04594185e+02 2.24121174e+01 8.50290739e-01 1.23180249e+02
1716.lowfreq: -5.0259 -3.9598 -0.0018 -0.0018 -0.0007 6.1450 17.5648 21.1956 32.3582
frequency: 17.4527 20.9342 32.2281 47.4955 68.0222 74.6608 84.6078 98.0376 110.4731 117.3325 134.7171 152.3317 153.7544 169.3741 175.5227 190.9952 205.4233 243.7315 250.8554 251.7694 276.1107 289.9179 307.9573 329.7962 355.4707 394.5042 409.7005 469.1210 486.4287 524.7531 543.6385 547.4307 577.7548 623.9553 631.8366 635.8689 690.4553 697.6489 735.4234 774.3997 783.8370 811.9004 826.2624 903.1497 929.0273 978.5876 999.5722 1029.4935 1040.3409 1052.8985 1055.6185 1092.7083 1098.1105 1098.7286 1149.3549 1150.2065 1154.7168 1183.0156 1191.3802 1206.3078 1226.7186 1248.0722 1250.2050 1254.0077 1282.5882 1288.5742 1309.4677 1391.0857 1406.2997 1409.0951 1411.8595 1413.6630 1428.6792 1438.7482 1442.9170 1468.1723 1469.4767 1471.6371 1477.8128 1481.7600 1484.2200 1488.9865 1492.7787 1556.7975 1589.7913 1627.9592 1689.6563 2889.3598 2958.3723 2959.5130 2964.0482 2966.5895 3026.5651 3029.4394 3030.6801 3032.4623 3033.8139 3108.2286 3127.1871 3128.2509 3130.2442 3136.4953 3461.3639 3517.4346 3594.4186
redmass: 6.2338 5.5670 10.7266 4.2718 2.4280 2.7461 2.0820 1.1822 3.1450 1.1369 1.6128 2.6492 1.6076 4.4034 3.7002 6.9376 4.4126 1.4722 2.5458 3.0942 3.4102 2.4294 3.2591 2.8486 3.9282 5.4884 3.4138 4.0267 4.0095 5.4340 4.7001 3.6737 1.3084 3.6589 6.0416 1.9806 4.4161 11.5892 4.3608 2.8735 12.0875 8.9846 5.9881 12.9773 1.8437 2.7868 3.4213 2.3496 2.2995 1.3877 1.3782 2.3772 1.2164 1.2167 1.3700 1.3677 1.1393 7.2202 3.4972 1.4455 2.1717 1.6581 3.2658 1.6367 6.7912 6.9871 1.3766 1.9190 1.2064 1.4986 1.2811 1.2172 3.4262 1.6147 1.1909 1.0518 1.0504 1.1650 1.0561 1.0744 2.4422 1.0466 1.0456 2.5426 3.8550 1.0946 9.1914 1.0811 1.0369 1.0372 1.0374 1.0377 1.0581 1.1011 1.1011 1.1015 1.1015 1.1065 1.0963 1.0957 1.0953 1.0951 1.0445 1.0640 1.0985
irintensity: 0.8709 0.9811 1.4974 2.9204 0.7112 0.2145 4.0933 0.0118 0.3986 0.0678 1.8773 1.5308 0.5215 2.2354 0.9588 0.5578 2.0500 26.6635 22.6965 0.3785 10.4922 14.2731 12.2972 4.3566 5.0323 4.9809 26.9707 46.9795 1.3159 2.1323 5.5917 19.9091 14.9720 42.7401 48.8286 210.4052 29.0773 0.5158 24.7438 3.0697 14.4949 46.9282 11.5465 11.7480 24.2778 162.0340 61.6140 181.7705 293.5062 1.5926 7.3973 31.4879 0.0937 0.0232 0.4553 0.0273 13.9034 133.0092 149.8009 5.3591 0.1645 1.4993 3.1927 29.1441 15.3052 123.0584 34.3059 7.0107 96.1181 335.4505 47.2709 6.9447 426.6051 4.8345 17.8818 6.7122 21.8576 37.5066 12.0928 23.7013 509.8007 14.4597 49.9005 946.1064 213.2412 47.6496 207.5419 48.4085 20.0395 38.4091 305.7110 108.5249 40.4766 40.0244 88.9041 14.6965 18.5317 5.7867 0.9148 1.2397 3.8339 1.5526 3.1337 21.1131 4.0905
temp: 298.150 k
press: 1.00000 atm
elementType: 16 8 8 7 7 7 7 7 7 6 6 6 6 6 6 6 6 6 6 1 1 1 1 1 1 1 1 1 1 1 1 1 1 1 1 1 1
symmnumber: 1
zpe: 767001.3 jmol-1
zpe.correction: 0.292135 hartree
zpe.thermalcorrener: 0.314397 hartree
zpe.thermalcorrenthalpy: 0.315341 hartree
zpe.thermalcorrgfe: 0.238049 hartree
zpe.sumelectzpe: -1267.413285 hartree
zpe.sumelectthermal: -1267.391023 hartree
zpe.sumelectthermalent: -1267.390079 hartree
zpe.sumelectthermalfe: -1267.467371 hartree
dipole: 0.1948 1.5475 0.4182
dipole: 1.6148
quadrupole: -89.7811 -112.5735 -114.7976
quadrupole: -0.0725 3.3517 -2.7025
quadrupole: 15.9363 -6.8560 -9.0802 -0.0725 3.3517 -2.7025
hfenergy: -1267.7054199 hartree
pointgroup: C01 [X(C10H18N6O2S1)]
dipole: -0.1059913 -0.577118 0.2435973 debye
polarizability: 243.6514811|-17.6326006|205.3142604|-26.7729399|-8.5958134|126.7761916 unknown
InChI: InChI=1S/C10H18N6O2S/c1-15(2)8-12-9(16(3)4)14-10(13-8)19-5-6(11)7(17)18/h6,17H,5,11H2,1-4H3
charge 0 multiplicity 1
37 atoms
S  1.255408 1.403703 -1.548177
O  4.688912 0.62759 1.368931
O  2.496414 -0.139919 1.34498
N  -1.644229 -2.496386 0.073166
N  -3.500411 1.844513 0.026287
N  -2.616132 -0.345476 0.066249
N  -1.268509 1.544089 -0.679519
N  -0.328725 -0.689724 -0.693788
N  4.75906 -0.758908 -1.112851
C  3.729349 0.259546 -0.799781
C  2.43563 -0.071447 -1.563301
C  -1.533269 -1.14806 -0.186992
C  -2.443254 0.99007 -0.200449
C  -0.277618 0.644953 -0.894041
C  3.509399 0.215462 0.716932
C  -0.520062 -3.41866 -0.134641
C  -2.885065 -3.075339 0.602505
C  -4.78521 1.357614 0.542355
C  -3.38726 3.287687 -0.225665
H  4.048989 1.301364 -1.044037
H  2.663516 -0.301544 -2.617532
H  1.885678 -0.909707 -1.10689
H  5.623418 -0.645792 -0.574014
H  4.92564 -0.877222 -2.116596
H  0.345695 -2.849055 -0.497652
H  -0.788893 -4.195305 -0.877433
H  -0.254444 -3.919679 0.8166
H  -2.707782 -3.526573 1.59873
H  -3.260628 -3.865817 -0.07641
H  -3.636974 -2.279399 0.692347
H  -5.021987 1.84309 1.509626
H  -4.720137 0.270192 0.685292
H  -5.600581 1.587844 -0.171351
H  -4.134574 3.607484 -0.978185
H  -2.375901 3.502241 -0.598069
H  -3.56552 3.856461 0.708068
H  4.557156 0.568709 2.353807
