program: Orca
programVersion: 5.0.2
elementType: N H C C H H O C C O N H H H C C O H O H N H H H C H H C C C C H C H C H H O H
charge: 1
multiplicity: 1
keywords: wB97X-D3BJ Opt Freq def2-TZVPP def2/J RIJCOSX VeryTightSCF
keywords: PAL8 defgrid3 VeryTightOpt
frequency: 0.00 0.00 0.00 0.00 0.00 0.00 15.76 18.62 25.70 41.02 51.49 60.82 67.78 86.47 92.00 103.97 131.45 177.84 197.54 251.35 269.79 283.34 289.93 313.37 361.07 370.58 390.87 402.00 426.04 429.69 433.88 478.13 514.69 521.48 527.24 566.51 597.13 609.38 615.78 639.75 651.88 658.47 702.36 719.37 745.30 752.17 822.99 847.32 858.42 870.18 874.85 889.27 893.89 956.55 980.42 988.81 992.12 1013.87 1014.76 1041.22 1074.18 1098.45 1124.48 1141.54 1150.69 1163.84 1195.43 1199.55 1206.87 1245.42 1249.88 1266.94 1275.68 1277.27 1309.28 1327.16 1334.38 1344.85 1361.31 1368.74 1379.38 1389.82 1397.74 1446.34 1455.50 1481.58 1492.64 1497.88 1500.61 1512.29 1580.39 1590.21 1640.58 1668.66 1671.06 1699.69 1774.84 1798.48 1899.52 3084.84 3087.25 3109.32 3129.22 3134.01 3142.76 3153.06 3159.29 3181.05 3186.62 3205.60 3231.57 3391.41 3551.53 3560.50 3643.93 3820.70 3875.13
frequency: 15.76 18.62 25.70 41.02 51.49 60.82 67.78 86.47 92.00 103.97 131.45 177.84 197.54 251.35 269.79 283.34 289.93 313.37 361.07 370.58 390.87 402.00 426.04 429.69 433.88 478.13 514.69 521.48 527.24 566.51 597.13 609.38 615.78 639.75 651.88 658.47 702.36 719.37 745.30 752.17 822.99 847.32 858.42 870.18 874.85 889.27 893.89 956.55 980.42 988.81 992.12 1013.87 1014.76 1041.22 1074.18 1098.45 1124.48 1141.54 1150.69 1163.84 1195.43 1199.55 1206.87 1245.42 1249.88 1266.94 1275.68 1277.27 1309.28 1327.16 1334.38 1344.85 1361.31 1368.74 1379.38 1389.82 1397.74 1446.34 1455.50 1481.58 1492.64 1497.88 1500.61 1512.29 1580.39 1590.21 1640.58 1668.66 1671.06 1699.69 1774.84 1798.48 1899.52 3084.84 3087.25 3109.32 3129.22 3134.01 3142.76 3153.06 3159.29 3181.05 3186.62 3205.60 3231.57 3391.41 3551.53 3560.50 3643.93 3820.70 3875.13
formula: C13H18N3O5
InChI: InChI=1S/C13H18N3O5/c14-10(5-8-1-3-9(17)4-2-8)13(21)16-6-11(18)15-7-12(19)20/h1-4,10,15-17,19H,5-7H2,14H3
39 atoms
N  -3.229842 1.645431 0.104771
H  -4.172443 1.300127 0.009079
C  -2.983588 3.07334 0.003451
C  -2.323811 3.689903 1.240686
H  -2.36323 3.331323 -0.855051
H  -3.942844 3.573843 -0.134876
O  -1.636032 4.662435 1.169254
C  -2.272212 0.683585 0.049245
C  -0.821158 1.158134 0.020157
O  -2.532542 -0.504774 0.036426
N  -0.000273 -0.033519 0.010711
H  -0.590777 1.776829 0.890526
H  -0.634688 1.766522 -0.868485
H  -0.526006 -0.900356 0.010101
C  1.325517 0.01122 0.017412
C  2.061346 -1.33505 0.110156
O  1.999408 1.036644 0.002972
H  1.699988 -2.057071 -0.620724
O  -2.567762 3.07237 2.410932
H  -3.142998 2.310936 2.271489
N  3.480687 -0.990463 -0.221655
H  3.524267 0.041849 -0.072284
H  4.122417 -1.508552 0.388608
H  3.718057 -1.186064 -1.191421
C  1.995443 -1.913921 1.535894
H  0.980446 -2.28135 1.696303
H  2.161065 -1.104898 2.252062
C  3.017995 -3.004844 1.733087
C  4.174819 -2.76862 2.470895
C  2.859261 -4.256115 1.128375
C  5.154816 -3.746878 2.605712
H  4.308823 -1.817427 2.978152
C  3.822524 -5.236799 1.254268
H  1.957469 -4.474732 0.564446
C  4.980727 -4.984722 1.995824
H  6.042447 -3.548539 3.196674
H  3.696468 -6.211088 0.799148
O  5.88354 -5.986026 2.081225
H  6.62227 -5.734097 2.641619
totalener: -1047.12761313 hartree
nucrepener: 1616.43770355 hartree
electener: -2663.56531668 hartree
oneelecener: -4616.68587496 hartree
twoeener: 1953.12055829 hartree
kineticenergy: 1041.95342036 hartree
exchangeener: -91.580644992323 hartree
correlationener: -6.611601972848 hartree
xcener: -98.192246965171 hartree
temp: 298.15 k
press: 1.00 atm
thermalcorrenthalpy: 0.00094421 hartree
totalenthalpy: -1046.86654020 hartree
totalentropycorr: -0.06471096 hartree
gibbsenthalpy: -1046.93125117 hartree
gibbsminuselec: 0.27600995 hartree
totalenthalpy: -1046.86855652 hartree
chargesum: 1.0000000
charge: -0.245182 0.213891 -0.100776 0.236661 0.131108 0.142270 -0.254728 0.238950 -0.092220 -0.350658 -0.172052 0.156686 0.137407 0.186880 0.227422 0.020495 -0.371287 0.156304 -0.223229 0.216459 -0.060998 0.233321 0.230665 0.231262 -0.198643 0.137307 0.137593 -0.015152 -0.242163 -0.155267 -0.133114 0.161015 -0.133135 0.133401 0.197981 0.121847 0.147042 -0.266458 0.219094
charge: 0.319301 -0.009512 -0.049146 -0.461024 0.033897 0.043454 0.153960 -0.376888 -0.017138 0.096815 0.355200 0.040210 0.037872 -0.021263 -0.386106 -0.036001 0.104754 0.035307 0.377515 -0.112650 0.616873 0.018115 0.039116 0.048812 0.002071 0.043061 0.044122 -0.120322 -0.019604 -0.001885 -0.013292 0.026438 0.017295 0.027634 -0.188950 0.023622 0.033717 0.374665 -0.100046
qa: -0.2452 0.2139 -0.1008 0.2367 0.1311 0.1423 -0.2547 0.2390 -0.0922 -0.3507 -0.1721 0.1567 0.1374 0.1869 0.2274 0.0205 -0.3713 0.1563 -0.2232 0.2165 -0.0610 0.2333 0.2307 0.2313 -0.1986 0.1373 0.1376 -0.0152 -0.2422 -0.1553 -0.1331 0.1610 -0.1331 0.1334 0.1980 0.1218 0.1470 -0.2665 0.2191
va: 3.1147 0.9956 3.8179 4.3453 1.0132 0.9900 2.2551 4.2613 3.8403 2.1645 3.2450 1.0134 0.9992 1.0496 4.2678 3.8054 2.1549 0.9995 2.2034 1.0321 3.6293 1.0345 1.0078 0.9780 3.8429 1.0096 1.0123 3.5681 3.9910 4.0348 3.9472 0.9994 4.0037 1.0030 4.0954 1.0058 1.0080 2.2366 1.0244
dispcorr: -0.080411716 hartree
energy: -1047.213405125156
dipole: 4.97474 -3.38722 1.58752 -4.45349 2.86732 -1.58616 -2.51909 1.01453 -1.50456
magnitude: 2.70182 au
magnitude: 6.86748 debye
zeropoint: 0.32322106 hartree
thermalvibcorrection: 0.01785676 hartree
thermalrotcorrection: 0.00141627 hartree
thermaltrasncorrection: 0.00141627 hartree
thermaltotal: -1046.86949476 hartree
thermalcorr: 0.02068930 hartree
nonthermalcorr: 0.32322106 hartree
totalcorr: 0.34391037 hartree
totalenthalpy: -1046.86855055 hartree
