program: Orca
programVersion: 5.0.2
elementType: N H C C H H O C C O N H H H C C O H O H N H H H C H H C C C C H C H C H H O H
charge: 1
multiplicity: 1
keywords: wB97X-D3BJ Opt Freq def2-TZVPP def2/J RIJCOSX VeryTightSCF
keywords: PAL8 defgrid3 VeryTightOpt
frequency: 0.00 0.00 0.00 0.00 0.00 0.00 14.86 19.09 25.64 30.38 52.95 63.87 70.84 82.69 104.09 149.72 178.33 185.76 221.65 249.45 274.52 301.72 322.12 329.58 354.35 381.43 387.74 392.41 428.08 431.11 447.83 477.10 505.36 509.44 536.15 574.76 589.47 613.15 637.58 658.48 660.57 673.30 693.12 708.77 746.74 792.65 798.11 851.81 857.09 862.01 867.34 872.83 884.25 919.95 968.02 993.38 994.98 1019.36 1043.52 1049.44 1058.42 1106.84 1132.49 1143.81 1152.82 1177.55 1194.78 1201.13 1209.65 1221.61 1250.50 1260.72 1292.16 1305.34 1333.03 1337.79 1339.35 1366.11 1375.27 1381.08 1389.80 1396.14 1423.37 1450.86 1474.79 1488.19 1492.86 1499.06 1533.84 1552.30 1566.25 1579.62 1650.69 1660.04 1672.09 1699.92 1738.42 1825.30 1881.49 2941.71 3101.57 3115.88 3121.81 3126.72 3153.20 3169.66 3176.05 3181.86 3196.65 3229.07 3231.04 3378.03 3548.66 3639.82 3662.31 3793.29 3877.35
frequency: 14.86 19.09 25.64 30.38 52.95 63.87 70.84 82.69 104.09 149.72 178.33 185.76 221.65 249.45 274.52 301.72 322.12 329.58 354.35 381.43 387.74 392.41 428.08 431.11 447.83 477.10 505.36 509.44 536.15 574.76 589.47 613.15 637.58 658.48 660.57 673.30 693.12 708.77 746.74 792.65 798.11 851.81 857.09 862.01 867.34 872.83 884.25 919.95 968.02 993.38 994.98 1019.36 1043.52 1049.44 1058.42 1106.84 1132.49 1143.81 1152.82 1177.55 1194.78 1201.13 1209.65 1221.61 1250.50 1260.72 1292.16 1305.34 1333.03 1337.79 1339.35 1366.11 1375.27 1381.08 1389.80 1396.14 1423.37 1450.86 1474.79 1488.19 1492.86 1499.06 1533.84 1552.30 1566.25 1579.62 1650.69 1660.04 1672.09 1699.92 1738.42 1825.30 1881.49 2941.71 3101.57 3115.88 3121.81 3126.72 3153.20 3169.66 3176.05 3181.86 3196.65 3229.07 3231.04 3378.03 3548.66 3639.82 3662.31 3793.29 3877.35
formula: C13H18N3O5
InChI: InChI=1S/C13H18N3O5/c14-10(5-8-1-3-9(17)4-2-8)13(21)16-6-11(18)15-7-12(19)20/h1-4,10,15-17,19H,5-7H2,14H3
39 atoms
N  -1.369315 1.910338 -2.893367
H  -1.367954 1.742751 -3.888109
C  -2.183077 2.994518 -2.386281
C  -3.618877 2.641367 -2.013275
H  -1.723825 3.447849 -1.506499
H  -2.23569 3.780888 -3.137603
O  -4.453739 3.472536 -1.811019
C  -0.724492 0.989941 -2.168469
C  -0.751346 1.136895 -0.64171
O  -0.123985 0.056718 -2.708366
N  0.000847 0.061024 -0.042382
H  -1.780378 1.115096 -0.285261
H  -0.304396 2.088445 -0.354478
H  -0.452164 -0.837561 -0.030532
C  1.35652 0.077301 -0.191246
C  1.996244 -1.308825 -0.3473
O  2.00488 1.088776 -0.328031
H  1.36751 -2.069452 0.116236
O  -3.828872 1.314425 -1.906884
H  -4.759527 1.191888 -1.672643
N  1.919791 -1.532142 -1.841703
H  1.921125 -2.520422 -2.083276
H  1.074197 -1.047745 -2.238892
H  2.763818 -1.118365 -2.256972
C  3.450074 -1.406284 0.165002
H  3.585523 -2.385263 0.626168
H  3.564512 -0.65912 0.950634
C  4.498609 -1.214749 -0.907608
C  5.092606 -2.32822 -1.509302
C  4.871901 0.053407 -1.352037
C  6.025059 -2.19045 -2.522452
H  4.839045 -3.325834 -1.162509
C  5.80794 0.205634 -2.365817
H  4.426151 0.931088 -0.900592
C  6.388191 -0.915568 -2.955178
H  6.494965 -3.053494 -2.976873
H  6.095264 1.20007 -2.691058
O  7.30674 -0.835808 -3.945375
H  7.518826 0.08147 -4.13631
totalener: -1047.13224370 hartree
nucrepener: 1680.74913435 hartree
electener: -2727.88137805 hartree
oneelecener: -4745.83974052 hartree
twoeener: 2017.95836247 hartree
kineticenergy: 1041.97639117 hartree
exchangeener: -91.585091818142 hartree
correlationener: -6.613540657758 hartree
xcener: -98.198632475900 hartree
temp: 298.15 k
press: 1.00 atm
thermalcorrenthalpy: 0.00094421 hartree
totalenthalpy: -1046.87302048 hartree
totalentropycorr: -0.06395127 hartree
gibbsenthalpy: -1046.93697175 hartree
gibbsminuselec: 0.27732789 hartree
totalenthalpy: -1046.87435981 hartree
chargesum: 1.0000000
charge: -0.161016 0.201264 -0.103387 0.277823 0.124674 0.158695 -0.260202 0.313893 -0.090075 -0.433308 -0.196870 0.147775 0.146168 0.175007 0.169563 -0.007258 -0.324563 0.138186 -0.281765 0.241101 -0.041054 0.221239 0.229224 0.237728 -0.175424 0.140135 0.141077 0.004600 -0.219061 -0.219539 -0.117214 0.134341 -0.123457 0.155740 0.190133 0.143924 0.116037 -0.271412 0.217279
charge: 0.350491 0.000817 -0.034716 -0.444472 0.040870 0.047562 0.148650 -0.347978 -0.035644 0.092901 0.325616 0.033526 0.040185 -0.022608 -0.390965 -0.035965 0.136367 0.031026 0.351811 -0.079191 0.610261 0.040727 -0.031579 0.044830 0.008994 0.036309 0.047203 -0.119273 -0.016783 -0.001038 0.004838 0.024299 -0.014577 0.028228 -0.190978 0.030911 0.022406 0.369524 -0.102585
qa: -0.1610 0.2013 -0.1034 0.2778 0.1247 0.1587 -0.2602 0.3139 -0.0901 -0.4333 -0.1969 0.1478 0.1462 0.1750 0.1696 -0.0073 -0.3246 0.1382 -0.2818 0.2411 -0.0411 0.2212 0.2292 0.2377 -0.1754 0.1401 0.1411 0.0046 -0.2191 -0.2195 -0.1172 0.1343 -0.1235 0.1557 0.1901 0.1439 0.1160 -0.2714 0.2173
va: 3.1996 1.0053 3.8204 4.3097 1.0077 1.0015 2.2479 4.1696 3.8148 2.0706 3.2444 1.0134 1.0121 1.0165 4.3134 3.8275 2.1684 1.0040 2.1707 1.0152 3.5845 0.9815 1.0796 0.9997 3.8552 0.9960 1.0134 3.6247 4.0340 4.0373 3.9904 1.0040 3.8979 1.0203 4.0984 1.0082 1.0069 2.2298 1.0256
dispcorr: -0.082778731 hartree
energy: -1047.219910607638
dipole: 3.89431 -4.69496 -0.80066 -5.34206 3.71187 -1.63020 2.34417 -2.38703 -0.04286
magnitude: 1.81671 au
magnitude: 4.61771 debye
zeropoint: 0.32422698 hartree
thermalvibcorrection: 0.01752348 hartree
thermalrotcorrection: 0.00141627 hartree
thermaltrasncorrection: 0.00141627 hartree
thermaltotal: -1046.87532760 hartree
thermalcorr: 0.02035603 hartree
nonthermalcorr: 0.32422698 hartree
totalcorr: 0.34458300 hartree
totalenthalpy: -1046.87438339 hartree
