program: Orca
programVersion: 5.0.2
elementType: N H C C H H O C C O N H H H C C O H O H N H H H C H H C C C C H C H C H H O H
charge: 1
multiplicity: 1
keywords: wB97X-D3BJ Opt Freq def2-TZVPP def2/J RIJCOSX VeryTightSCF
keywords: PAL8 defgrid3 VeryTightOpt
frequency: 0.00 0.00 0.00 0.00 0.00 0.00 24.29 31.67 39.24 50.98 59.35 71.13 88.22 92.61 107.86 118.99 174.15 195.90 210.50 244.01 279.79 297.90 306.29 355.90 365.95 392.47 401.52 417.83 429.15 436.88 442.60 456.93 475.38 518.94 529.76 563.73 584.53 604.15 619.57 631.50 660.98 683.92 697.86 717.91 744.12 747.16 816.65 849.08 866.59 869.14 883.90 886.55 918.10 936.16 982.41 987.68 997.95 1015.03 1030.98 1039.31 1053.66 1115.65 1130.40 1146.15 1153.35 1168.55 1193.86 1196.18 1207.76 1220.99 1247.01 1272.95 1282.04 1294.71 1307.06 1319.40 1331.37 1341.57 1347.84 1371.17 1389.86 1391.77 1420.38 1450.39 1461.53 1491.98 1495.51 1502.18 1504.71 1519.28 1578.24 1595.12 1604.83 1671.75 1678.73 1698.63 1774.63 1795.87 1876.39 3062.59 3082.65 3083.48 3091.75 3129.73 3136.26 3140.57 3168.85 3169.77 3207.01 3227.80 3231.11 3350.47 3571.13 3573.92 3637.42 3848.13 3876.43
frequency: 24.29 31.67 39.24 50.98 59.35 71.13 88.22 92.61 107.86 118.99 174.15 195.90 210.50 244.01 279.79 297.90 306.29 355.90 365.95 392.47 401.52 417.83 429.15 436.88 442.60 456.93 475.38 518.94 529.76 563.73 584.53 604.15 619.57 631.50 660.98 683.92 697.86 717.91 744.12 747.16 816.65 849.08 866.59 869.14 883.90 886.55 918.10 936.16 982.41 987.68 997.95 1015.03 1030.98 1039.31 1053.66 1115.65 1130.40 1146.15 1153.35 1168.55 1193.86 1196.18 1207.76 1220.99 1247.01 1272.95 1282.04 1294.71 1307.06 1319.40 1331.37 1341.57 1347.84 1371.17 1389.86 1391.77 1420.38 1450.39 1461.53 1491.98 1495.51 1502.18 1504.71 1519.28 1578.24 1595.12 1604.83 1671.75 1678.73 1698.63 1774.63 1795.87 1876.39 3062.59 3082.65 3083.48 3091.75 3129.73 3136.26 3140.57 3168.85 3169.77 3207.01 3227.80 3231.11 3350.47 3571.13 3573.92 3637.42 3848.13 3876.43
formula: C13H18N3O5
InChI: InChI=1S/C13H18N3O5/c14-10(5-8-1-3-9(17)4-2-8)13(21)16-6-11(18)15-7-12(19)20/h1-4,10,15-17,19H,5-7H2,14H3
39 atoms
N  -3.271312 1.651521 0.804361
H  -4.087887 1.221357 1.211915
C  -2.984752 3.010107 1.185572
C  -2.118381 3.099636 2.447938
H  -2.470664 3.545663 0.382021
H  -3.930133 3.531291 1.346489
O  -1.540223 2.157527 2.910643
C  -2.339154 0.749152 0.40602
C  -1.021493 1.288894 -0.150128
O  -2.542092 -0.4506 0.422664
N  -0.128919 0.152963 -0.246699
H  -0.571085 2.037134 0.49887
H  -1.204068 1.741288 -1.129208
H  -0.6114 -0.736542 -0.203379
C  1.170387 0.250256 0.007526
C  1.941478 -1.075259 0.18323
O  1.793314 1.303449 0.104816
H  2.003651 -1.582276 -0.780544
O  -2.004197 4.317307 2.993585
H  -2.540929 4.973251 2.536176
N  3.316469 -0.613965 0.560611
H  3.457107 -0.757273 1.569128
H  4.062704 -1.058304 0.034353
H  3.275858 0.420052 0.388568
C  1.371564 -2.004781 1.270317
H  1.894945 -2.962025 1.217316
H  0.325819 -2.210943 1.037645
C  1.521654 -1.395649 2.642593
C  2.597315 -1.752519 3.459893
C  0.646183 -0.408816 3.095707
C  2.808796 -1.134881 4.683549
H  3.264771 -2.555172 3.155418
C  0.844488 0.216402 4.314315
H  -0.217767 -0.124403 2.507356
C  1.932317 -0.140548 5.11123
H  3.633819 -1.421413 5.323312
H  0.148914 0.983344 4.637211
O  2.182842 0.435334 6.309401
H  1.506021 1.084797 6.517063
totalener: -1047.13604980 hartree
nucrepener: 1773.70718120 hartree
electener: -2820.84323100 hartree
oneelecener: -4931.66491925 hartree
twoeener: 2110.82168826 hartree
kineticenergy: 1042.89724094 hartree
exchangeener: -91.749476804368 hartree
correlationener: -6.627739140354 hartree
xcener: -98.377215944722 hartree
temp: 298.15 k
press: 1.00 atm
thermalcorrenthalpy: 0.00094421 hartree
totalenthalpy: -1046.87606174 hartree
totalentropycorr: -0.06746162 hartree
gibbsenthalpy: -1046.94352336 hartree
gibbsminuselec: 0.27755900 hartree
chargesum: 1.0000000
charge: -0.185969 0.193940 -0.162387 0.316833 0.137102 0.147358 -0.312680 0.263453 -0.083008 -0.359589 -0.170711 0.126469 0.141379 0.185851 0.225299 -0.006561 -0.374763 0.162757 -0.212913 0.220805 -0.055827 0.224720 0.228902 0.227133 -0.227784 0.137982 0.134858 0.053886 -0.248214 -0.159652 -0.134017 0.162043 -0.136958 0.120368 0.207856 0.144918 0.120637 -0.271905 0.218388
charge: 0.329097 -0.003582 -0.066300 -0.440208 0.036675 0.036593 0.136723 -0.375722 -0.021968 0.095694 0.357105 0.031144 0.034646 -0.024635 -0.376860 -0.030537 0.113747 0.038331 0.393559 -0.093096 0.614667 0.038806 0.038229 0.004692 0.000091 0.038702 0.041313 -0.115862 -0.027823 0.009124 0.004572 0.022678 0.001614 0.025369 -0.188699 0.030608 0.023770 0.369415 -0.101672
qa: -0.1860 0.1939 -0.1624 0.3168 0.1371 0.1474 -0.3127 0.2635 -0.0830 -0.3596 -0.1707 0.1265 0.1414 0.1859 0.2253 -0.0066 -0.3748 0.1628 -0.2129 0.2208 -0.0558 0.2247 0.2289 0.2271 -0.2278 0.1380 0.1349 0.0539 -0.2482 -0.1597 -0.1340 0.1620 -0.1370 0.1204 0.2079 0.1449 0.1206 -0.2719 0.2184
va: 3.1815 1.0124 3.9078 4.2383 0.9857 0.9954 2.1660 4.2759 3.8550 2.1505 3.2740 1.0171 0.9977 1.0476 4.2391 3.9015 2.1450 0.9945 2.2613 1.0213 3.5894 1.0203 0.9774 1.0439 3.8922 1.0054 1.0131 3.4804 3.9739 4.0552 4.0434 0.9968 3.9136 1.0143 4.0668 1.0084 1.0256 2.2298 1.0245
dispcorr: -0.084738678 hartree
energy: -1047.221177134461
dipole: 4.57623 -3.38536 1.19087 -3.03689 3.28451 0.24762 -5.47297 3.17085 -2.30212
magnitude: 2.60370 au
magnitude: 6.61807 debye
zeropoint: 0.32382702 hartree
thermalvibcorrection: 0.01736931 hartree
thermalrotcorrection: 0.00141627 hartree
thermaltrasncorrection: 0.00141627 hartree
thermaltotal: -1046.87714826 hartree
thermalcorr: 0.02020185 hartree
nonthermalcorr: 0.32382702 hartree
totalcorr: 0.34402887 hartree
totalenthalpy: -1046.87620405 hartree
