program: Orca
programVersion: 5.0.2
elementType: N H C C H H O C C O N H H H C C O H O H N H H H C H H C C C C H C H C H H O H
charge: 1
multiplicity: 1
keywords: wB97X-D3BJ Opt Freq def2-TZVPP def2/J RIJCOSX VeryTightSCF
keywords: PAL8 defgrid3 VeryTightOpt
frequency: 0.00 0.00 0.00 0.00 0.00 0.00 13.24 15.85 28.78 43.04 56.95 62.50 73.53 82.50 94.88 124.20 150.43 198.44 228.82 274.50 288.26 298.06 304.03 318.81 358.19 383.71 397.22 409.81 428.61 433.51 436.96 462.21 499.26 512.00 531.88 562.68 588.91 617.08 635.10 647.34 658.52 673.11 695.46 701.46 744.05 748.55 802.54 845.37 849.98 861.07 868.17 879.50 884.77 954.34 967.75 988.62 992.55 1019.99 1041.98 1046.52 1054.78 1102.11 1132.92 1139.90 1158.03 1162.66 1198.52 1198.71 1210.01 1229.41 1250.84 1291.14 1295.38 1317.76 1328.84 1332.64 1334.08 1357.18 1369.83 1379.13 1384.06 1395.39 1400.51 1435.38 1443.14 1478.27 1485.88 1493.47 1501.75 1520.67 1581.36 1612.22 1639.84 1666.29 1673.75 1701.78 1766.11 1794.38 1874.49 2876.16 3057.59 3110.76 3119.55 3119.74 3143.05 3160.89 3177.13 3178.63 3203.78 3216.81 3232.47 3511.21 3581.76 3599.71 3650.04 3796.64 3877.47
frequency: 13.24 15.85 28.78 43.04 56.95 62.50 73.53 82.50 94.88 124.20 150.43 198.44 228.82 274.50 288.26 298.06 304.03 318.81 358.19 383.71 397.22 409.81 428.61 433.51 436.96 462.21 499.26 512.00 531.88 562.68 588.91 617.08 635.10 647.34 658.52 673.11 695.46 701.46 744.05 748.55 802.54 845.37 849.98 861.07 868.17 879.50 884.77 954.34 967.75 988.62 992.55 1019.99 1041.98 1046.52 1054.78 1102.11 1132.92 1139.90 1158.03 1162.66 1198.52 1198.71 1210.01 1229.41 1250.84 1291.14 1295.38 1317.76 1328.84 1332.64 1334.08 1357.18 1369.83 1379.13 1384.06 1395.39 1400.51 1435.38 1443.14 1478.27 1485.88 1493.47 1501.75 1520.67 1581.36 1612.22 1639.84 1666.29 1673.75 1701.78 1766.11 1794.38 1874.49 2876.16 3057.59 3110.76 3119.55 3119.74 3143.05 3160.89 3177.13 3178.63 3203.78 3216.81 3232.47 3511.21 3581.76 3599.71 3650.04 3796.64 3877.47
formula: C13H18N3O5
InChI: InChI=1S/C13H18N3O5/c14-10(5-8-1-3-9(17)4-2-8)13(21)16-6-11(18)15-7-12(19)20/h1-4,10,15-17,19H,5-7H2,14H3
39 atoms
N  -1.035348 2.350536 2.693425
H  -0.902276 2.36335 3.692365
C  -2.016802 3.243125 2.1249
C  -3.437148 2.703838 1.99336
H  -2.080412 4.140926 2.738997
H  -1.71474 3.584598 1.133302
O  -4.356412 3.385732 1.643498
C  -0.428666 1.320859 2.064152
C  -0.674943 1.198682 0.550764
O  0.293685 0.529287 2.643018
N  0.01318 0.029383 0.046964
H  -0.304844 2.088097 0.040776
H  -1.738743 1.09538 0.343223
H  -0.44515 -0.861205 0.17784
C  1.345827 0.022608 0.049224
C  2.057196 -1.34534 -0.029494
O  2.051881 1.027076 0.093066
H  1.862291 -1.810731 -0.995385
O  -3.542228 1.392133 2.285199
H  -4.474785 1.156069 2.184855
N  3.509281 -0.954283 0.016594
H  4.04241 -1.265241 -0.790746
H  3.43799 0.1053 0.040008
H  3.965245 -1.287845 0.863636
C  1.713866 -2.304321 1.118715
H  1.813581 -1.766962 2.064996
H  2.446539 -3.118132 1.106691
C  0.31877 -2.873926 0.999181
C  -0.661308 -2.561082 1.942626
C  -0.020568 -3.715067 -0.058285
C  -1.947297 -3.06077 1.826041
H  -0.416729 -1.903343 2.76819
C  -1.304559 -4.222154 -0.187554
H  0.725727 -3.997216 -0.795301
C  -2.275495 -3.893039 0.757263
H  -2.70746 -2.824127 2.559777
H  -1.549716 -4.87937 -1.014988
O  -3.548621 -4.347748 0.692715
H  -3.65951 -4.939574 -0.055788
totalener: -1047.13052829 hartree
nucrepener: 1741.00479040 hartree
electener: -2788.13531869 hartree
oneelecener: -4866.81041277 hartree
twoeener: 2078.67509407 hartree
kineticenergy: 1041.97847177 hartree
exchangeener: -91.586559118543 hartree
correlationener: -6.614467330637 hartree
xcener: -98.201026449180 hartree
temp: 298.15 k
press: 1.00 atm
thermalcorrenthalpy: 0.00094421 hartree
totalenthalpy: -1046.87298916 hartree
totalentropycorr: -0.06396703 hartree
gibbsenthalpy: -1046.93695618 hartree
gibbsminuselec: 0.27671198 hartree
totalenthalpy: -1046.87435868 hartree
totalenthalpy: -1046.87438203 hartree
chargesum: 1.0000000
charge: -0.184261 0.194094 -0.106482 0.275102 0.151623 0.122054 -0.271059 0.279871 -0.092071 -0.387062 -0.186857 0.142943 0.138499 0.201192 0.240331 -0.006828 -0.362991 0.160906 -0.277084 0.236117 -0.056993 0.232318 0.229422 0.227926 -0.169706 0.140396 0.135774 -0.039436 -0.185434 -0.181245 -0.134752 0.153277 -0.136896 0.119651 0.198096 0.140879 0.113660 -0.272503 0.217531
charge: 0.333953 -0.006596 -0.047069 -0.445864 0.046497 0.039089 0.139305 -0.382868 -0.029398 0.075636 0.357240 0.037015 0.031985 -0.011441 -0.354840 -0.030410 0.135360 0.037305 0.352516 -0.082446 0.607961 0.041307 -0.009676 0.045554 -0.004496 0.044354 0.033708 -0.114610 0.001922 -0.009974 0.002480 0.029560 -0.013488 0.023274 -0.190989 0.030346 0.021937 0.368574 -0.102709
qa: -0.1843 0.1941 -0.1065 0.2751 0.1516 0.1221 -0.2711 0.2799 -0.0921 -0.3871 -0.1869 0.1429 0.1385 0.2012 0.2403 -0.0068 -0.3630 0.1609 -0.2771 0.2361 -0.0570 0.2323 0.2294 0.2279 -0.1697 0.1404 0.1358 -0.0394 -0.1854 -0.1812 -0.1348 0.1533 -0.1369 0.1197 0.1981 0.1409 0.1137 -0.2725 0.2175
va: 3.1841 1.0118 3.8408 4.2978 1.0015 1.0082 2.2390 4.2216 3.7935 2.1141 3.3345 1.0095 1.0132 1.0170 4.2710 3.8499 2.1675 0.9995 2.1737 1.0182 3.6053 0.9756 1.0561 0.9809 3.8457 1.0127 0.9948 3.6986 3.9780 4.0378 3.9724 1.0142 3.9438 1.0075 4.0767 1.0096 1.0081 2.2282 1.0253
dispcorr: -0.083604771 hartree
energy: -1047.219443971906
dipole: 9.77477 -5.99737 3.77740 -4.70153 3.24841 -1.45312 -3.74229 2.05166 -1.69064
magnitude: 4.38617 au
magnitude: 11.14877 debye
zeropoint: 0.32370839 hartree
thermalvibcorrection: 0.01757675 hartree
thermalrotcorrection: 0.00141627 hartree
thermaltrasncorrection: 0.00141627 hartree
thermaltotal: -1046.87532628 hartree
thermalcorr: 0.02040929 hartree
nonthermalcorr: 0.32370839 hartree
totalcorr: 0.34411769 hartree
totalenthalpy: -1046.87438207 hartree
