program: Orca
programVersion: 5.0.2
elementType: N H C C H H O C C O N H H H C C O H O H N H H H C H H C C C C H C H C H H O H
charge: 1
multiplicity: 1
keywords: wB97X-D3BJ Opt Freq def2-TZVPP def2/J RIJCOSX VeryTightSCF
keywords: PAL8 defgrid3 VeryTightOpt
frequency: 0.00 0.00 0.00 0.00 0.00 0.00 18.94 25.85 33.38 39.69 62.11 77.14 87.47 112.32 124.19 148.97 186.25 197.21 238.58 262.56 279.94 292.06 292.97 325.18 344.75 374.76 383.27 398.06 427.38 429.34 434.71 465.26 498.79 517.98 527.16 556.88 572.62 578.42 625.58 651.08 659.09 683.51 692.95 722.45 746.83 791.68 804.37 843.66 853.83 866.31 871.37 880.00 886.98 926.66 975.84 989.72 992.58 1008.88 1026.44 1042.61 1050.47 1093.57 1119.33 1136.83 1142.69 1170.84 1195.90 1198.77 1207.62 1230.98 1246.01 1277.21 1292.08 1299.93 1324.60 1331.82 1341.63 1354.00 1363.98 1371.69 1378.77 1391.09 1434.11 1458.13 1478.31 1491.94 1492.60 1501.02 1523.55 1529.98 1576.19 1581.45 1628.82 1670.53 1676.64 1702.17 1742.46 1779.95 1887.78 3072.94 3115.84 3119.14 3122.89 3123.81 3143.24 3174.79 3179.73 3181.11 3193.01 3208.40 3231.13 3479.16 3556.55 3632.15 3679.76 3780.47 3878.47
frequency: 18.94 25.85 33.38 39.69 62.11 77.14 87.47 112.32 124.19 148.97 186.25 197.21 238.58 262.56 279.94 292.06 292.97 325.18 344.75 374.76 383.27 398.06 427.38 429.34 434.71 465.26 498.79 517.98 527.16 556.88 572.62 578.42 625.58 651.08 659.09 683.51 692.95 722.45 746.83 791.68 804.37 843.66 853.83 866.31 871.37 880.00 886.98 926.66 975.84 989.72 992.58 1008.88 1026.44 1042.61 1050.47 1093.57 1119.33 1136.83 1142.69 1170.84 1195.90 1198.77 1207.62 1230.98 1246.01 1277.21 1292.08 1299.93 1324.60 1331.82 1341.63 1354.00 1363.98 1371.69 1378.77 1391.09 1434.11 1458.13 1478.31 1491.94 1492.60 1501.02 1523.55 1529.98 1576.19 1581.45 1628.82 1670.53 1676.64 1702.17 1742.46 1779.95 1887.78 3072.94 3115.84 3119.14 3122.89 3123.81 3143.24 3174.79 3179.73 3181.11 3193.01 3208.40 3231.13 3479.16 3556.55 3632.15 3679.76 3780.47 3878.47
formula: C13H18N3O5
InChI: InChI=1S/C13H18N3O5/c14-10(5-8-1-3-9(17)4-2-8)13(21)16-6-11(18)15-7-12(19)20/h1-4,10,15-17,19H,5-7H2,14H3
39 atoms
N  0.054885 2.907363 -2.125123
H  0.464649 3.086532 -3.030047
C  -0.457468 4.041959 -1.374212
C  0.466109 4.657464 -0.310486
H  -0.689392 4.841414 -2.074973
H  -1.396759 3.790033 -0.880755
O  0.199479 5.730849 0.138843
C  0.036736 1.619711 -1.766158
C  -0.575199 1.269371 -0.395155
O  0.51134 0.737713 -2.484658
N  0.051657 0.050374 0.069401
H  -1.647048 1.104748 -0.509855
H  -0.430144 2.068911 0.328218
H  -0.447201 -0.81491 -0.04573
C  1.396744 0.030172 0.017319
C  2.067794 -1.302307 -0.312059
O  2.081741 1.040892 0.012048
H  1.35007 -2.120883 -0.363175
O  1.528874 3.959722 0.110407
H  1.617776 3.080344 -0.280113
N  2.531385 -1.034018 -1.733816
H  2.823037 -1.883163 -2.21386
H  1.767982 -0.548146 -2.254484
H  3.317185 -0.381899 -1.698913
C  3.227663 -1.639001 0.612099
H  3.933236 -0.804562 0.610154
H  3.745641 -2.527605 0.240635
C  2.688478 -1.873619 2.003571
C  2.636077 -0.836104 2.928813
C  2.180429 -3.121431 2.366439
C  2.090677 -1.034384 4.189207
H  3.03138 0.140625 2.670811
C  1.632494 -3.333151 3.618227
H  2.22968 -3.951157 1.667205
C  1.585582 -2.284606 4.536919
H  2.06626 -0.218901 4.904264
H  1.24957 -4.303066 3.909175
O  1.041474 -2.547992 5.748482
H  1.091889 -1.774343 6.315564
totalener: -1047.11850874 hartree
nucrepener: 1734.07604615 hartree
electener: -2781.19455489 hartree
oneelecener: -4851.72528525 hartree
twoeener: 2070.53073036 hartree
kineticenergy: 1041.96537504 hartree
exchangeener: -91.586985087985 hartree
correlationener: -6.615905950173 hartree
xcener: -98.202891038158 hartree
temp: 298.15 k
press: 1.00 atm
thermalcorrenthalpy: 0.00094421 hartree
totalenthalpy: -1046.86094730 hartree
totalentropycorr: -0.06330743 hartree
gibbsenthalpy: -1046.92425473 hartree
gibbsminuselec: 0.27812599 hartree
totalenthalpy: -1046.86307943 hartree
chargesum: 1.0000000
charge: -0.170836 0.208285 -0.124171 0.260751 0.152541 0.130214 -0.255055 0.271847 -0.127548 -0.435991 -0.104011 0.151398 0.146179 0.185677 0.117131 0.059866 -0.394054 0.145083 -0.224685 0.224088 -0.068340 0.233038 0.253038 0.234701 -0.165815 0.130863 0.122344 0.034800 -0.187041 -0.191152 -0.129923 0.142842 -0.133652 0.123540 0.189123 0.113220 0.139191 -0.274159 0.216672
charge: 0.345879 0.001979 -0.042301 -0.458770 0.046011 0.037250 0.155880 -0.375468 -0.024005 0.066853 0.349585 0.041291 0.034340 -0.013421 -0.385313 -0.040903 0.113501 0.037286 0.386425 -0.134773 0.612922 0.045548 0.008156 0.056588 -0.005966 0.040245 0.034888 -0.104981 0.003623 -0.006002 -0.012841 0.028947 0.007514 0.023687 -0.189584 0.021804 0.030101 0.367547 -0.103521
qa: -0.1708 0.2083 -0.1242 0.2608 0.1525 0.1302 -0.2551 0.2718 -0.1275 -0.4360 -0.1040 0.1514 0.1462 0.1857 0.1171 0.0599 -0.3941 0.1451 -0.2247 0.2241 -0.0683 0.2330 0.2530 0.2347 -0.1658 0.1309 0.1223 0.0348 -0.1870 -0.1912 -0.1299 0.1428 -0.1337 0.1235 0.1891 0.1132 0.1392 -0.2742 0.2167
va: 3.1400 0.9996 3.8200 4.3565 1.0037 0.9994 2.2576 4.1612 3.8805 2.0610 3.1741 0.9987 1.0106 1.0104 4.3177 3.8249 2.1064 1.0070 2.2155 1.0461 3.6237 0.9734 1.0311 0.9866 3.8935 1.0240 1.0066 3.6361 4.0414 4.0457 3.9261 1.0085 4.0130 1.0034 4.0860 1.0063 1.0092 2.2257 1.0259
dispcorr: -0.084054396 hartree
energy: -1047.208637382710
dipole: 1.19949 -1.18153 0.01796 -8.03092 5.42823 -2.60269 -4.82715 1.57838 -3.24877
magnitude: 4.16280 au
magnitude: 10.58098 debye
zeropoint: 0.32442159 hartree
thermalvibcorrection: 0.01735439 hartree
thermalrotcorrection: 0.00141627 hartree
thermaltrasncorrection: 0.00141627 hartree
thermaltotal: -1046.86402886 hartree
thermalcorr: 0.02018694 hartree
nonthermalcorr: 0.32442159 hartree
totalcorr: 0.34460853 hartree
totalenthalpy: -1046.86308465 hartree
