program: Orca
programVersion: 5.0.2
elementType: N H C C H H O C C O N H H H C C O H O H N H H H C H H C C C C H C H C H H O H
charge: 1
multiplicity: 1
keywords: wB97X-D3BJ Opt Freq def2-TZVPP def2/J RIJCOSX VeryTightSCF
keywords: PAL8 defgrid3 VeryTightOpt
frequency: 0.00 0.00 0.00 0.00 0.00 0.00 16.37 30.34 32.40 47.86 51.69 61.88 72.50 96.24 102.38 146.81 175.02 181.76 211.06 236.23 290.77 298.72 310.14 316.79 363.60 366.30 378.82 382.99 427.60 429.18 434.55 453.28 485.21 505.02 513.60 555.84 570.81 603.21 617.28 639.21 659.27 667.84 715.46 719.95 749.55 780.27 820.88 850.93 855.62 858.79 875.24 883.46 885.40 927.15 959.82 982.05 998.19 1010.55 1041.99 1054.72 1073.59 1083.78 1123.60 1141.38 1156.85 1161.46 1191.72 1198.49 1206.65 1241.84 1248.77 1281.02 1292.67 1300.62 1306.11 1331.58 1339.69 1343.76 1352.27 1370.41 1397.44 1419.49 1433.54 1446.14 1478.78 1493.64 1496.24 1500.95 1505.54 1527.79 1572.42 1580.41 1609.32 1673.18 1677.99 1701.48 1747.51 1812.98 1886.07 3087.53 3090.49 3123.00 3128.06 3141.41 3144.90 3181.05 3183.92 3190.06 3203.75 3223.76 3230.83 3464.47 3522.20 3641.57 3655.10 3850.90 3878.31
frequency: 16.37 30.34 32.40 47.86 51.69 61.88 72.50 96.24 102.38 146.81 175.02 181.76 211.06 236.23 290.77 298.72 310.14 316.79 363.60 366.30 378.82 382.99 427.60 429.18 434.55 453.28 485.21 505.02 513.60 555.84 570.81 603.21 617.28 639.21 659.27 667.84 715.46 719.95 749.55 780.27 820.88 850.93 855.62 858.79 875.24 883.46 885.40 927.15 959.82 982.05 998.19 1010.55 1041.99 1054.72 1073.59 1083.78 1123.60 1141.38 1156.85 1161.46 1191.72 1198.49 1206.65 1241.84 1248.77 1281.02 1292.67 1300.62 1306.11 1331.58 1339.69 1343.76 1352.27 1370.41 1397.44 1419.49 1433.54 1446.14 1478.78 1493.64 1496.24 1500.95 1505.54 1527.79 1572.42 1580.41 1609.32 1673.18 1677.99 1701.48 1747.51 1812.98 1886.07 3087.53 3090.49 3123.00 3128.06 3141.41 3144.90 3181.05 3183.92 3190.06 3203.75 3223.76 3230.83 3464.47 3522.20 3641.57 3655.10 3850.90 3878.31
formula: C13H18N3O5
InChI: InChI=1S/C13H18N3O5/c14-10(5-8-1-3-9(17)4-2-8)13(21)16-6-11(18)15-7-12(19)20/h1-4,10,15-17,19H,5-7H2,14H3
39 atoms
N  0.616473 2.521157 -2.163747
H  0.837026 2.234015 -3.105099
C  -0.202259 3.69747 -1.999165
C  -1.697068 3.362035 -1.911074
H  0.078513 4.246387 -1.096023
H  -0.01374 4.366141 -2.840448
O  -2.098864 2.25235 -1.716772
C  0.817484 1.567358 -1.236839
C  0.404008 1.881244 0.210785
O  1.347495 0.498018 -1.531181
N  0.63382 0.711689 1.028522
H  -0.648832 2.14964 0.251993
H  1.001671 2.71296 0.584684
H  -0.046587 -0.022248 0.916577
C  1.924938 0.31937 1.178421
C  2.18897 -1.189941 1.175794
O  2.87578 1.072519 1.169304
H  1.27347 -1.776999 1.098028
O  -2.533922 4.401999 -2.016755
H  -2.07336 5.227479 -2.200206
N  2.906402 -1.353399 -0.141346
H  3.125676 -2.334516 -0.317786
H  2.334661 -0.917705 -0.889269
H  3.779622 -0.823849 -0.091249
C  3.075305 -1.690626 2.311795
H  2.487139 -1.651884 3.230914
H  3.908529 -0.995004 2.432418
C  3.571726 -3.089586 2.03353
C  2.729668 -4.190821 2.174986
C  4.869736 -3.306508 1.568158
C  3.163002 -5.470087 1.861018
H  1.721325 -4.056947 2.554799
C  5.317226 -4.577944 1.24728
H  5.556983 -2.469863 1.480131
C  4.461472 -5.667826 1.393097
H  2.497049 -6.316696 1.990411
H  6.328805 -4.747304 0.900585
O  4.949863 -6.887759 1.069917
H  4.296924 -7.570943 1.242114
totalener: -1047.13197352 hartree
nucrepener: 1642.76154392 hartree
electener: -2689.89351744 hartree
oneelecener: -4669.97565562 hartree
twoeener: 1980.08213818 hartree
kineticenergy: 1042.86572450 hartree
exchangeener: -91.742632374897 hartree
correlationener: -6.622709771185 hartree
xcener: -98.365342146081 hartree
temp: 298.15 k
press: 1.00 atm
thermalcorrenthalpy: 0.00094421 hartree
totalenthalpy: -1046.86919949 hartree
totalentropycorr: -0.06697850 hartree
gibbsenthalpy: -1046.93617799 hartree
gibbsminuselec: 0.27732150 hartree
totalenthalpy: -1046.87223797 hartree
chargesum: 1.0000000
charge: -0.170137 0.194726 -0.157695 0.300828 0.136140 0.147834 -0.284633 0.321448 -0.097932 -0.451360 -0.160174 0.154523 0.144450 0.177744 0.150588 0.013558 -0.331696 0.138341 -0.206634 0.217977 -0.066210 0.238968 0.255131 0.230870 -0.182861 0.128531 0.140371 -0.005522 -0.177459 -0.202974 -0.138956 0.132093 -0.132434 0.140955 0.196302 0.114865 0.144313 -0.270952 0.217075
charge: 0.344614 -0.001211 -0.058591 -0.447919 0.036929 0.035899 0.143865 -0.345243 -0.031497 0.071449 0.328478 0.033227 0.039213 -0.016456 -0.391021 -0.045807 0.118339 0.033917 0.396504 -0.094701 0.617042 0.043903 0.007386 0.056548 0.002021 0.045407 0.042290 -0.115531 -0.006426 -0.018015 -0.010737 0.026275 0.005856 0.024501 -0.191331 0.022589 0.031326 0.369600 -0.102692
qa: -0.1701 0.1947 -0.1577 0.3008 0.1361 0.1478 -0.2846 0.3214 -0.0979 -0.4514 -0.1602 0.1545 0.1445 0.1777 0.1506 0.0136 -0.3317 0.1383 -0.2066 0.2180 -0.0662 0.2390 0.2551 0.2309 -0.1829 0.1285 0.1404 -0.0055 -0.1775 -0.2030 -0.1390 0.1321 -0.1324 0.1410 0.1963 0.1149 0.1443 -0.2710 0.2171
va: 3.2103 1.0109 3.8647 4.3101 0.9892 0.9964 2.2048 4.1659 3.8375 2.0451 3.2286 1.0125 1.0091 1.0135 4.3402 3.9297 2.1839 1.0101 2.2682 1.0227 3.6369 0.9764 1.0202 0.9954 3.8325 1.0117 1.0231 3.5142 4.0386 3.9746 3.9417 1.0050 4.0029 1.0031 4.0892 1.0072 1.0080 2.2289 1.0259
dispcorr: -0.082424898 hartree
energy: -1047.218476754238
dipole: 3.60269 -3.58211 0.02058 -1.29437 2.06077 0.76640 2.26687 -3.05228 -0.78540
magnitude: 1.09757 au
magnitude: 2.78979 debye
zeropoint: 0.32429962 hartree
thermalvibcorrection: 0.01761556 hartree
thermalrotcorrection: 0.00141627 hartree
thermaltrasncorrection: 0.00141627 hartree
thermaltotal: -1046.87372903 hartree
thermalcorr: 0.02044810 hartree
nonthermalcorr: 0.32429962 hartree
totalcorr: 0.34474772 hartree
totalenthalpy: -1046.87278483 hartree
