program: Orca
programVersion: 5.0.2
elementType: N H C C H H O C C O N H H H C C O H O H N H H H C H H C C C C H C H C H H O H
charge: 1
multiplicity: 1
keywords: wB97X-D3BJ Opt Freq def2-TZVPP def2/J RIJCOSX VeryTightSCF
keywords: PAL8 defgrid3 VeryTightOpt
frequency: 0.00 0.00 0.00 0.00 0.00 0.00 15.56 33.15 36.26 54.26 60.71 67.80 75.34 88.08 105.69 138.95 184.26 187.41 209.50 265.00 284.51 300.24 308.66 351.49 368.87 386.55 398.95 422.56 429.30 432.01 438.44 461.50 505.98 526.95 534.36 567.27 586.26 630.37 634.62 660.92 664.20 680.83 724.28 742.38 746.10 750.91 808.90 848.16 857.40 873.25 884.17 893.34 900.37 926.96 964.23 977.64 995.76 1037.69 1040.88 1046.83 1059.54 1103.63 1135.08 1140.79 1151.62 1164.59 1192.61 1200.62 1212.73 1223.17 1249.70 1261.03 1292.56 1297.87 1323.06 1331.75 1336.85 1345.17 1358.59 1380.82 1391.45 1398.28 1447.96 1455.42 1457.50 1487.01 1493.62 1495.54 1501.79 1513.19 1581.72 1599.30 1608.12 1668.87 1673.51 1699.51 1776.14 1803.26 1832.99 3014.30 3090.76 3093.42 3129.87 3130.77 3140.99 3161.34 3178.07 3186.24 3202.07 3203.49 3232.25 3349.22 3575.71 3632.25 3639.12 3799.33 3877.87
frequency: 15.56 33.15 36.26 54.26 60.71 67.80 75.34 88.08 105.69 138.95 184.26 187.41 209.50 265.00 284.51 300.24 308.66 351.49 368.87 386.55 398.95 422.56 429.30 432.01 438.44 461.50 505.98 526.95 534.36 567.27 586.26 630.37 634.62 660.92 664.20 680.83 724.28 742.38 746.10 750.91 808.90 848.16 857.40 873.25 884.17 893.34 900.37 926.96 964.23 977.64 995.76 1037.69 1040.88 1046.83 1059.54 1103.63 1135.08 1140.79 1151.62 1164.59 1192.61 1200.62 1212.73 1223.17 1249.70 1261.03 1292.56 1297.87 1323.06 1331.75 1336.85 1345.17 1358.59 1380.82 1391.45 1398.28 1447.96 1455.42 1457.50 1487.01 1493.62 1495.54 1501.79 1513.19 1581.72 1599.30 1608.12 1668.87 1673.51 1699.51 1776.14 1803.26 1832.99 3014.30 3090.76 3093.42 3129.87 3130.77 3140.99 3161.34 3178.07 3186.24 3202.07 3203.49 3232.25 3349.22 3575.71 3632.25 3639.12 3799.33 3877.87
formula: C13H18N3O5
InChI: InChI=1S/C13H18N3O5/c14-10(5-8-1-3-9(17)4-2-8)13(21)16-6-11(18)15-7-12(19)20/h1-4,10,15-17,19H,5-7H2,14H3
39 atoms
N  -2.737865 1.135646 1.825686
H  -3.013823 1.075939 2.794036
C  -3.739586 0.814221 0.840229
C  -3.613905 -0.600188 0.290307
H  -4.725556 0.928883 1.288285
H  -3.717381 1.499952 -0.011189
O  -2.61791 -1.279866 0.353803
C  -1.388908 1.079889 1.656918
C  -0.827102 1.109317 0.234104
O  -0.625105 1.031433 2.599664
N  0.005159 -0.065031 0.045437
H  -0.193702 1.991242 0.151177
H  -1.586692 1.146832 -0.543248
H  -0.470693 -0.95099 0.127602
C  1.33361 -0.008246 0.008712
C  2.075914 -1.362599 -0.019858
O  2.004706 1.016755 -0.045045
H  1.823266 -1.875581 -0.948433
O  -4.737804 -0.984116 -0.310767
H  -4.610668 -1.870538 -0.676019
N  3.516382 -0.958189 -0.081522
H  4.028674 -1.360942 -0.860075
H  3.456296 0.089487 -0.159459
H  3.973232 -1.19406 0.809031
C  1.821926 -2.273746 1.198597
H  2.11677 -3.291794 0.937321
H  0.748244 -2.296708 1.391879
C  2.585816 -1.81251 2.416332
C  2.197518 -0.669434 3.124583
C  3.736896 -2.487347 2.818191
C  2.939426 -0.220407 4.199666
H  1.298628 -0.127171 2.850003
C  4.490684 -2.04379 3.89918
H  4.041996 -3.393183 2.301815
C  4.091139 -0.905818 4.593148
H  2.636167 0.657665 4.755681
H  5.375207 -2.590894 4.2074
O  4.768929 -0.415014 5.655878
H  5.521956 -0.973468 5.865183
totalener: -1047.13803882 hartree
nucrepener: 1728.85538993 hartree
electener: -2775.99342875 hartree
oneelecener: -4842.74990080 hartree
twoeener: 2066.75647205 hartree
kineticenergy: 1041.99273078 hartree
exchangeener: -91.591911629424 hartree
correlationener: -6.616022004398 hartree
xcener: -98.207933633822 hartree
temp: 298.15 k
press: 1.00 atm
thermalcorrenthalpy: 0.00094421 hartree
totalenthalpy: -1046.87988677 hartree
totalentropycorr: -0.06365407 hartree
gibbsenthalpy: -1046.94354084 hartree
gibbsminuselec: 0.27766731 hartree
totalenthalpy: -1046.88153708 hartree
chargesum: 1.0000000
charge: -0.181760 0.191249 -0.109011 0.338705 0.148187 0.133889 -0.366725 0.222055 -0.070606 -0.353548 -0.157838 0.145872 0.126929 0.196744 0.237321 -0.035205 -0.365898 0.161265 -0.242189 0.242488 -0.055051 0.226701 0.226716 0.230283 -0.212868 0.131160 0.132206 -0.024614 -0.098180 -0.218890 -0.159895 0.133564 -0.145511 0.152491 0.206660 0.149653 0.116789 -0.268644 0.215507
charge: 0.326233 -0.006679 -0.053676 -0.427871 0.044834 0.037468 0.100443 -0.385790 -0.015281 0.097832 0.356391 0.043312 0.020342 -0.021524 -0.372562 -0.030814 0.123045 0.036967 0.390688 -0.076183 0.613262 0.036591 0.001114 0.037242 0.000616 0.036882 0.039598 -0.121733 0.013472 -0.024498 0.018557 0.024205 -0.020155 0.023332 -0.189041 0.034456 0.020982 0.371044 -0.103101
qa: -0.1818 0.1912 -0.1090 0.3387 0.1482 0.1339 -0.3667 0.2221 -0.0706 -0.3535 -0.1578 0.1459 0.1269 0.1967 0.2373 -0.0352 -0.3659 0.1613 -0.2422 0.2425 -0.0551 0.2267 0.2267 0.2303 -0.2129 0.1312 0.1322 -0.0246 -0.0982 -0.2189 -0.1599 0.1336 -0.1455 0.1525 0.2067 0.1497 0.1168 -0.2686 0.2155
va: 3.1283 1.0123 3.8839 4.2130 1.0065 0.9992 2.1051 4.3024 3.7663 2.1502 3.2723 1.0307 1.0022 1.0212 4.2493 3.8901 2.1589 0.9946 2.2608 1.0154 3.5963 0.9794 1.0479 1.0117 3.8855 1.0049 1.0105 3.5666 3.9407 3.9887 4.0193 1.0614 3.9590 0.9996 4.0678 1.0058 1.0069 2.2324 1.0265
dispcorr: -0.083590196 hartree
energy: -1047.226995796274
dipole: 4.36160 -3.58200 0.77960 -4.10117 2.33645 -1.76472 -4.87728 2.19058 -2.68671
magnitude: 3.30763 au
magnitude: 8.40733 debye
zeropoint: 0.32441129 hartree
thermalvibcorrection: 0.01727080 hartree
thermalrotcorrection: 0.00141627 hartree
thermaltrasncorrection: 0.00141627 hartree
thermaltotal: -1046.88248116 hartree
thermalcorr: 0.02010334 hartree
nonthermalcorr: 0.32441129 hartree
totalcorr: 0.34451463 hartree
totalenthalpy: -1046.88153695 hartree
