program: Orca
programVersion: 5.0.2
elementType: N H C C H H O C C O N H H H C C O H O H N H H H C H H C C C C H C H C H H O H
charge: 1
multiplicity: 1
keywords: wB97X-D3BJ Opt Freq def2-TZVPP def2/J RIJCOSX VeryTightSCF
keywords: PAL8 defgrid3 VeryTightOpt
frequency: 0.00 0.00 0.00 0.00 0.00 0.00 11.52 20.44 29.20 36.56 46.52 58.23 70.77 88.81 112.40 150.84 154.06 170.11 222.50 246.53 284.27 294.53 311.31 329.71 339.50 351.54 370.46 373.42 405.68 428.16 434.95 500.60 511.65 521.04 538.17 560.11 569.85 596.22 614.26 618.69 646.68 659.80 671.74 745.26 759.75 785.67 800.83 803.70 848.78 871.85 874.63 881.99 944.31 963.45 979.65 983.68 1002.40 1015.93 1016.89 1036.50 1043.21 1103.47 1138.42 1140.60 1152.24 1165.60 1198.14 1200.00 1206.73 1232.82 1247.21 1268.27 1273.39 1296.20 1328.22 1331.49 1345.87 1357.28 1364.83 1373.11 1391.34 1397.42 1422.40 1461.15 1475.45 1494.62 1494.96 1497.50 1500.93 1525.05 1581.03 1595.76 1622.05 1676.01 1685.03 1703.68 1740.72 1797.82 1891.55 3070.25 3090.27 3101.16 3131.31 3143.74 3156.69 3178.07 3195.64 3197.93 3200.68 3230.71 3314.93 3432.39 3552.13 3633.57 3661.56 3799.60 3880.61
frequency: 11.52 20.44 29.20 36.56 46.52 58.23 70.77 88.81 112.40 150.84 154.06 170.11 222.50 246.53 284.27 294.53 311.31 329.71 339.50 351.54 370.46 373.42 405.68 428.16 434.95 500.60 511.65 521.04 538.17 560.11 569.85 596.22 614.26 618.69 646.68 659.80 671.74 745.26 759.75 785.67 800.83 803.70 848.78 871.85 874.63 881.99 944.31 963.45 979.65 983.68 1002.40 1015.93 1016.89 1036.50 1043.21 1103.47 1138.42 1140.60 1152.24 1165.60 1198.14 1200.00 1206.73 1232.82 1247.21 1268.27 1273.39 1296.20 1328.22 1331.49 1345.87 1357.28 1364.83 1373.11 1391.34 1397.42 1422.40 1461.15 1475.45 1494.62 1494.96 1497.50 1500.93 1525.05 1581.03 1595.76 1622.05 1676.01 1685.03 1703.68 1740.72 1797.82 1891.55 3070.25 3090.27 3101.16 3131.31 3143.74 3156.69 3178.07 3195.64 3197.93 3200.68 3230.71 3314.93 3432.39 3552.13 3633.57 3661.56 3799.60 3880.61
formula: C13H18N3O5
InChI: InChI=1S/C13H18N3O5/c14-10(5-8-1-3-9(17)4-2-8)13(21)16-6-11(18)15-7-12(19)20/h1-4,10,15-17,19H,5-7H2,14H3
39 atoms
N  -1.634606 -1.724294 -2.571869
H  -2.544308 -1.715466 -2.140011
C  -1.546081 -2.174538 -3.951139
C  -2.868014 -2.674126 -4.497959
H  -1.206184 -1.364606 -4.600139
H  -0.821385 -2.984353 -4.044879
O  -2.981957 -3.149863 -5.587191
C  -0.558595 -1.308601 -1.903742
C  -0.779937 -0.93197 -0.431873
O  0.562142 -1.26218 -2.412892
N  0.101484 0.131501 -0.008106
H  -0.630188 -1.825653 0.179708
H  -1.806368 -0.609993 -0.261244
H  -0.260721 1.073431 -0.022653
C  1.447515 0.073892 -0.011225
C  2.146479 -1.293199 -0.037835
O  2.166742 1.056512 0.007977
H  1.481353 -2.125341 -0.24251
O  -3.889096 -2.514368 -3.629512
H  -4.692723 -2.8438 -4.054789
N  3.052297 -1.167644 -1.230093
H  3.741943 -1.914313 -1.282211
H  2.435545 -1.177019 -2.057586
H  3.521466 -0.257762 -1.165678
C  2.925609 -1.530526 1.252589
H  3.608917 -0.695608 1.419862
H  3.517937 -2.444818 1.150771
C  1.948476 -1.659655 2.397307
C  1.332725 -2.876832 2.670356
C  1.597247 -0.54736 3.161786
C  0.387571 -2.990296 3.680564
H  1.60421 -3.762253 2.102763
C  0.657101 -0.644591 4.172038
H  2.070591 0.409457 2.96767
C  0.047757 -1.870167 4.435706
H  -0.071537 -3.950274 3.892585
H  0.391332 0.21364 4.776186
O  -0.862333 -1.907982 5.439616
H  -1.175255 -2.805624 5.576048
totalener: -1047.13826059 hartree
nucrepener: 1679.21149219 hartree
electener: -2726.34975278 hartree
oneelecener: -4742.76359974 hartree
twoeener: 2016.41384697 hartree
kineticenergy: 1041.98740175 hartree
exchangeener: -91.590859441258 hartree
correlationener: -6.611717376200 hartree
xcener: -98.202576817457 hartree
temp: 298.15 k
press: 1.00 atm
thermalcorrenthalpy: 0.00094421 hartree
totalenthalpy: -1046.87734723 hartree
totalentropycorr: -0.06455821 hartree
gibbsenthalpy: -1046.94190545 hartree
gibbsminuselec: 0.27747858 hartree
totalenthalpy: -1046.87901956 hartree
chargesum: 1.0000000
charge: -0.169390 0.185578 -0.063059 0.293561 0.137745 0.131424 -0.266408 0.335039 -0.091329 -0.479082 -0.144081 0.126271 0.129631 0.195909 0.137837 -0.010242 -0.328057 0.131865 -0.294506 0.243700 -0.051715 0.224651 0.256939 0.235661 -0.152182 0.138845 0.113392 0.077581 -0.259332 -0.175918 -0.120403 0.123311 -0.123252 0.141347 0.176907 0.111148 0.140749 -0.274553 0.214416
charge: 0.345521 -0.020432 -0.020256 -0.431752 0.043548 0.041032 0.151065 -0.370026 -0.038639 0.064690 0.346753 0.035429 0.036238 0.000385 -0.391044 -0.051514 0.102477 0.029632 0.347778 -0.076473 0.615311 0.044496 0.021984 0.051126 -0.001808 0.041247 0.032551 -0.102531 -0.011386 0.007706 -0.020729 0.023044 0.006879 0.030738 -0.192246 0.019554 0.030404 0.364809 -0.105560
qa: -0.1694 0.1856 -0.0631 0.2936 0.1377 0.1314 -0.2664 0.3350 -0.0913 -0.4791 -0.1441 0.1263 0.1296 0.1959 0.1378 -0.0102 -0.3281 0.1319 -0.2945 0.2437 -0.0517 0.2247 0.2569 0.2357 -0.1522 0.1388 0.1134 0.0776 -0.2593 -0.1759 -0.1204 0.1233 -0.1233 0.1413 0.1769 0.1111 0.1407 -0.2746 0.2144
va: 3.2474 1.0307 3.8420 4.3175 1.0056 1.0106 2.2424 4.0623 3.9062 2.0280 3.1105 0.9985 1.0031 1.0090 4.3958 3.9177 2.2041 1.0233 2.1546 1.0151 3.5959 0.9771 1.0034 0.9972 3.8709 1.0196 1.0079 3.5909 4.0418 4.0244 3.9101 1.0075 3.9723 1.0070 4.0939 1.0061 1.0084 2.2226 1.0274
dispcorr: -0.082070548 hartree
energy: -1047.224848147059
dipole: 6.73446 -5.88706 0.84740 -2.06475 1.18672 -0.87803 3.01749 -3.78044 -0.76296
magnitude: 1.43914 au
magnitude: 3.65801 debye
zeropoint: 0.32431741 hartree
thermalvibcorrection: 0.01773301 hartree
thermalrotcorrection: 0.00141627 hartree
thermaltrasncorrection: 0.00141627 hartree
thermaltotal: -1046.87996519 hartree
thermalcorr: 0.02056555 hartree
nonthermalcorr: 0.32431741 hartree
totalcorr: 0.34488296 hartree
totalenthalpy: -1046.87902098 hartree
