program: Orca
programVersion: 5.0.2
elementType: N H C C H H O C C O N H H H C C O H O H N H H H C H H C C C C H C H C H H O H
charge: 1
multiplicity: 1
keywords: wB97X-D3BJ Opt Freq def2-TZVPP def2/J RIJCOSX VeryTightSCF
keywords: PAL8 defgrid3 VeryTightOpt
frequency: 0.00 0.00 0.00 0.00 0.00 0.00 32.46 46.81 57.03 76.71 81.07 90.31 91.83 111.38 140.18 142.14 176.99 199.49 224.05 246.84 270.14 283.74 309.71 313.62 337.27 365.20 376.42 431.02 439.63 448.42 455.97 489.84 511.65 526.77 547.99 587.15 595.89 616.80 657.83 666.72 685.50 699.98 714.75 722.80 755.97 769.99 826.07 840.57 869.23 877.21 886.82 893.96 900.49 910.29 948.54 995.23 1018.19 1026.40 1027.08 1042.78 1060.74 1085.25 1105.84 1123.61 1144.02 1180.64 1209.04 1211.00 1217.13 1248.33 1259.58 1267.03 1285.77 1309.99 1317.37 1334.41 1349.32 1354.28 1375.24 1383.98 1397.21 1409.17 1432.54 1452.37 1472.07 1487.16 1492.68 1494.24 1507.98 1513.18 1575.37 1586.02 1649.65 1666.80 1669.07 1697.52 1802.63 1811.96 1823.90 3041.87 3082.75 3109.14 3143.62 3154.38 3159.60 3162.11 3172.98 3202.98 3225.78 3231.44 3348.72 3490.52 3493.33 3542.39 3630.05 3671.40 3793.67
frequency: 32.46 46.81 57.03 76.71 81.07 90.31 91.83 111.38 140.18 142.14 176.99 199.49 224.05 246.84 270.14 283.74 309.71 313.62 337.27 365.20 376.42 431.02 439.63 448.42 455.97 489.84 511.65 526.77 547.99 587.15 595.89 616.80 657.83 666.72 685.50 699.98 714.75 722.80 755.97 769.99 826.07 840.57 869.23 877.21 886.82 893.96 900.49 910.29 948.54 995.23 1018.19 1026.40 1027.08 1042.78 1060.74 1085.25 1105.84 1123.61 1144.02 1180.64 1209.04 1211.00 1217.13 1248.33 1259.58 1267.03 1285.77 1309.99 1317.37 1334.41 1349.32 1354.28 1375.24 1383.98 1397.21 1409.17 1432.54 1452.37 1472.07 1487.16 1492.68 1494.24 1507.98 1513.18 1575.37 1586.02 1649.65 1666.80 1669.07 1697.52 1802.63 1811.96 1823.90 3041.87 3082.75 3109.14 3143.62 3154.38 3159.60 3162.11 3172.98 3202.98 3225.78 3231.44 3348.72 3490.52 3493.33 3542.39 3630.05 3671.40 3793.67
formula: C13H18N3O5
InChI: InChI=1S/C13H18N3O5/c14-10(5-8-1-3-9(17)4-2-8)13(21)16-6-11(18)15-7-12(19)20/h1-4,10,15-17,19H,5-7H2,14H3
39 atoms
N  -2.84364 -0.745325 -2.196347
H  -2.677344 -1.720232 -2.38071
C  -3.903615 -0.068717 -2.904436
C  -3.502763 0.424239 -4.284739
H  -4.751248 -0.744922 -3.032586
H  -4.243312 0.78418 -2.319174
O  -2.565975 0.015153 -4.93163
C  -1.951361 -0.030778 -1.471176
C  -0.930262 -0.854834 -0.67092
O  -1.969629 1.179627 -1.388987
N  0.023844 0.072808 -0.082399
H  -0.460613 -1.565874 -1.349021
H  -1.496884 -1.399434 0.093907
H  -0.311397 1.030837 -0.172108
C  1.389213 0.020521 -0.07236
C  2.137817 -1.308681 0.126565
O  2.088725 1.004449 -0.110433
H  2.847695 -1.117283 0.930963
O  -4.34499 1.350865 -4.722776
H  -4.087739 1.609498 -5.618996
N  1.232731 -2.41784 0.619364
H  1.775675 -3.14808 1.079575
H  0.53957 -2.060922 1.27779
H  0.749992 -2.8384 -0.18541
C  2.859662 -1.771038 -1.147968
H  3.456396 -2.66077 -0.927961
H  3.551257 -0.971565 -1.41351
C  1.852977 -2.024492 -2.238204
C  1.24067 -3.27131 -2.382497
C  1.388943 -0.964384 -3.018552
C  0.138089 -3.439999 -3.211268
H  1.64016 -4.136992 -1.857975
C  0.300297 -1.119158 -3.857717
H  1.869295 0.005547 -2.946772
C  -0.363273 -2.349213 -3.921385
H  -0.342424 -4.404568 -3.319654
H  -0.063008 -0.284121 -4.443575
O  -1.490755 -2.523866 -4.636496
H  -1.822285 -1.658628 -4.934076
totalener: -1047.11418648 hartree
nucrepener: 1823.79000116 hartree
electener: -2870.90418763 hartree
oneelecener: -5030.63120313 hartree
twoeener: 2159.72701549 hartree
kineticenergy: 1041.97643713 hartree
exchangeener: -91.586369881251 hartree
correlationener: -6.622639408352 hartree
xcener: -98.209009289603 hartree
temp: 298.15 k
press: 1.00 atm
thermalcorrenthalpy: 0.00094421 hartree
totalenthalpy: -1046.86246889 hartree
totalentropycorr: -0.06257070 hartree
gibbsenthalpy: -1046.92503959 hartree
gibbsminuselec: 0.27938967 hartree
totalenthalpy: -1046.86500069 hartree
chargesum: 1.0000000
charge: -0.207063 0.186897 -0.086577 0.355813 0.144799 0.146679 -0.378355 0.252938 -0.112932 -0.351981 -0.197120 0.055733 0.153542 0.206693 0.117717 0.029731 -0.267200 0.175238 -0.237688 0.246744 -0.054473 0.241398 0.233758 0.230675 -0.218280 0.133570 0.155088 0.042945 -0.286171 -0.158191 -0.089585 0.161330 -0.104723 0.160193 0.085241 0.148462 0.147325 -0.311667 0.249497
charge: 0.332099 -0.020108 -0.033951 -0.414709 0.042176 0.045880 0.125519 -0.378734 -0.056096 0.117189 0.308244 0.014350 0.018215 -0.006543 -0.403323 -0.032517 0.141615 0.047941 0.400570 -0.071340 0.615327 0.056082 0.053555 0.036414 0.006175 0.035669 0.055855 -0.117182 -0.037074 0.011104 -0.009469 0.021217 0.002513 0.037530 -0.217138 0.030322 0.030153 0.358749 -0.146279
qa: -0.2071 0.1869 -0.0866 0.3558 0.1448 0.1467 -0.3784 0.2529 -0.1129 -0.3520 -0.1971 0.0557 0.1535 0.2067 0.1177 0.0297 -0.2672 0.1752 -0.2377 0.2467 -0.0545 0.2414 0.2338 0.2307 -0.2183 0.1336 0.1551 0.0429 -0.2862 -0.1582 -0.0896 0.1613 -0.1047 0.1602 0.0852 0.1485 0.1473 -0.3117 0.2495
va: 3.1897 1.0146 3.8334 4.2002 0.9993 1.0222 2.0867 4.3417 3.9107 2.1724 3.0499 1.0055 0.9863 1.0377 4.4302 3.7303 2.2518 1.0019 2.2743 1.0122 3.6329 0.9671 0.9806 1.0127 3.8982 1.0035 1.0139 3.4714 3.9878 3.9689 3.9596 0.9972 3.8075 1.0073 4.0563 1.0105 1.0128 2.1966 1.0469
dispcorr: -0.090581716 hartree
energy: -1047.210972867130
dipole: 4.91490 -4.37686 0.53804 -9.18798 6.22331 -2.96467 7.80981 -4.98561 2.82420
magnitude: 4.12976 au
magnitude: 10.49700 debye
zeropoint: 0.32528080 hartree
thermalvibcorrection: 0.01691431 hartree
thermalrotcorrection: 0.00141627 hartree
thermaltrasncorrection: 0.00141627 hartree
thermaltotal: -1046.86594522 hartree
thermalcorr: 0.01974685 hartree
nonthermalcorr: 0.32528080 hartree
totalcorr: 0.34502765 hartree
totalenthalpy: -1046.86500101 hartree
